{"text_format":"3","workbook":"xlsx","n_sheets":21,"sheets":["Wstęp","Instrukcja","Obliczenia nośności T","Obliczenia nośności W","Obliczenia nośności H","Obliczenia wiatr I","Obliczenia wiatr II","Wyniki graficzne wiatr I","Wyniki graficzne wiatr II","Łączniki wiatr I","Łączniki wiatr II","Przemieszczenia wiatr I","Przemieszczenia wiatr II","Wyniki końcowe wiatr I","Wyniki końcowe wiatr II","Rozmieszczenie łączników","Strefy i teren","Wsp kierunkowy","Pola ścian","Wysokość przemieszczenia","Notatki"],"not_rendered":{"images":49,"defined_names":50,"comments":10},"read":"whole","date_system":"1900"}

{"sheet":"Wstęp","index":0,"n_rows":51,"n_cols":2,"rows_kept":51,"merged":[[0,1,13,15],[14,1,17,15],[18,1,23,15],[24,1,31,15],[32,1,34,15],[35,1,38,15],[39,1,41,15],[42,1,46,15],[47,1,49,15],[50,1,53,15]]}
{"$rows_empty":14}
[null,"Właściciel licencji i autor nie biorą odpowiedzialności za decyzje podjęte przez użytkownika pod wpływem informacji uzyskanych w oparciu o program, jak również za prawidłowość działania programu oraz przydatność uzyskanych przy jego użyciu informacji. Wszelkie zapytania dotyczące funkcjonowania programu należy kierować wyłącznie do Stowarzyszenia Na Rzecz Systemów Ociepleń – SSO. "]
[]
[]
[]
[null,"Program został opracowany w postaci zespołu arkuszy kalkulacyjnych Microsoft® Excel®, umożliwiających określenie:\n- oddziaływania ssania wiatru na ściany budynku,\n- nośności układu łączników mechanicznych i nośności systemu ETICS,\n- przemieszczenia w miejscu występowania łącznika,\n- wymaganej, minimalnej liczby łączników, przypadających na 1 m² powierzchni."]
[]
[]
[]
[]
[]
[null,"Wyznaczanie oddziaływania wiatru możliwe jest w dwóch wariantach:\n- podstawowym, stosowanym gdy nie uwzględnia się wpływu położenia budynku względem stron świata na obciążenie wiatrem i ze wszystkich stron budynku przyjmuje się taką samą kategorię terenu,\n- rozszerzonym, stosowanym gdy uwzględnia się wpływ położenia budynku względem stron świata na obciążenie wiatrem lub przyjmuje się różne kategorie terenu w zależności od kierunku. Wariant ten umożliwia także uwzględnienie wpływu sąsiedniej zabudowy na obciążenie wiatrem.\nOba warianty kalkulatora odnoszą się zasadniczo do budynków o rzucie prostokątnym, nie mających części o różnej wysokości (nie dotyczy to połaci dachowych). Jednak stosując metodę wyodrębniania brył, istnieje możliwość prowadzenia obliczeń budynków o złożonych kształtach."]
{"$rows_empty":7}
[null,"W programie zostały ponadto zawarte materiały informacyjne i pomocnicze z zakresu ustalania oddziaływania wiatru, umożliwiające prawidłowe zinterpretowanie wprowadzanych danych obliczeniowych i otrzymanych wyników."]
[]
[]
[null,"Program nie zawiera kalkulatora służącego do wyznaczania wartości współczynnika rzeźby terenu (orografii). W tym względzie można posłużyć się na przykład arkuszami kalkulacyjnymi dołączonymi do książki: J.A. Żurański, M. Gaczek, Projektowanie według Eurokodów -- Oddziaływania klimatyczne na konstrukcje budowlane według Eurokodu 1 -- Komentarze z przykładami obliczeń; Instytut Techniki Budowlanej, Warszawa 2011."]
[]
[]
[]
[null,"Arkusze kalkulacyjne zawarte w programie, tylko częściowo zostały zabezpieczone przed wprowadzaniem niewłaściwych danych, dlatego też wykonując obliczenia należy mieć pełną świadomość przyjmowanych wartości."]
[]
[]
[null,"Autor programu dołożył wszelkich starań i sprawdził prawidłowość działania programu w wielu sytuacjach obliczeniowych. Nie można jednak wykluczyć, że przy określonym zestawie wprowadzonych wartości, wystąpi w obliczeniach nie wykryty wcześniej błąd. Dotyczyć to może zwłaszcza graficznego przedstawienia wyników obliczania oddziaływania wiatru. Z tego względu, w odpowiednich arkuszach pozostawiono nie ukryte pośrednie etapy obliczeniowe. Zaleca się ich sprawdzanie, zgodnie z zawartymi tam uwagami."]
[]
[]
[]
[]
[null,"Autor programu nie ponosi jakiejkolwiek odpowiedzialności za ewentualne szkody wynikające z tytułu wykorzystania programu."]
[]
[]
[null,"Wykorzystanie programu w jakimkolwiek zakresie możliwe jest na zasadzie cytowania - podając autora, nazwę i wersję (datę) programu. Zamieszczenie programu w całości albo we fragmencie na stronie internetowej innej niż strona Licencjobiorcy jest zabronione. Wprowadzanie w programie jakichkolwiek zmian bez pisemnej zgody autora jest zabronione."]

{"sheet":"Instrukcja","index":1,"n_rows":223,"n_cols":2,"rows_kept":223,"merged":[[1,1,2,15],[4,1,5,15],[6,1,53,15],[55,1,56,15],[57,1,108,15],[110,1,111,15],[112,1,174,15],[176,1,177,15],[178,1,196,15],[198,1,199,15],[200,1,218,15],[220,1,221,15],[222,1,236,15]]}
[]
[null,"Instrukcja wykonywania obliczeń"]
[]
[]
[null,"Obliczanie nośności łączników mechanicznych Rd,f, nośności systemu ETICS Rd,ETICS oraz nośności miarodajnej Rd"]
[]
[null,"Obliczenia wykonuje się w arkuszach kalkulacyjnych o nazwach: „Obliczenia nośności T”, „Obliczenia nośności W” albo „Obliczenia nośności H”.\nNależy wybrać odpowiedni arkusz kalkulacyjny w zależności od przyjętego układu łączników (mocowanie na „T”, „W” albo „H”).\nKomórki każdego arkusza wymagające wstawienia wartości albo sprawdzenia wartości przyjętej jako domyślna, wyróżniono kolorem szarym.\n\nW celu przeprowadzenia obliczeń nośności układu łączników mechanicznych na wyrywanie z podłoża (Rd,f), nośności systemu ociepleń ETICS na przeciąganie przez łączniki (Rd,ETICS) oraz nośności miarodajnej (Rd) do sprawdzenia warunku pierwszego stanu granicznego, należy:\n\n- przyjąć długość płyty z materiału termoizolacyjnego zastosowanego do wykonania ocieplenia,\n- przyjąć szerokość płyty z materiału termoizolacyjnego zastosowanego do wykonania ocieplenia,\n- w przypadku deklarowania własnego schematu rozmieszczenia łączników na płycie izolacyjnej, w zależności od przyjętego układu łączników przyjąć liczbę łączników umieszczonych w polu płyty, liczbę łączników umieszczonych przy obrzeżach płyty, liczbę łączników umieszczonych w spoinach,\n- na podstawie dokumentu ETA (Europejskiej Aprobaty Technicznej, a po jej wygaśnięciu – Europejskiej Oceny Technicznej) albo karty technicznej, przyjąć wartość charakterystyczną nośności łącznika na wyrywanie, NR,k, w zależności od producenta i typu łącznika oraz rodzaju podłoża, w którym będzie osadzony. Należy przyjmować łączniki wyszczególnione w dokumencie ETA, wydanym dla danego systemu ociepleń,\n- sprawdzić i ewentualnie skorygować aktualnie obowiązującą krajową wartość częściowego współczynnika bezpieczeństwa przy wyrywaniu łącznika z podłoża; wartość wynikająca z dokumentu EAD 330196-01-0604 to 2,0,\n- na podstawie dokumentu ETA, dokumentu DoP albo karty technicznej systemu ociepleń ETICS, przyjąć wartość charakterystyczną nośności systemu (siłę niszczącą, siłę maksymalną) z uwagi na przeciąganie przez łącznik umieszczony w polu płyty, Fk,a (Rpanel), w zależności od: producenta systemu, rodzaju materiału termoizolacyjnego, jego grubości i wytrzymałości TR na rozciąganie prostopadle do powierzchni (względnie naprężenia ściskającego CS przy 10 % odkształceniu), sposobu montażu łączników (powierzchniowego albo zagłębionego), średnicy i sztywności talerzyka łącznika (jeśli podano),\n- w przypadku położenia łączników przy obrzeżu płyty - krawędzi albo narożu (patrz rysunek w arkuszu Rozmieszczenie łaczników) - na podstawie dokumentu ETA, dokumentu DoP albo karty technicznej systemu ociepleń ETICS, przyjąć wartość charakterystyczną nośności systemu (siłę niszczącą, siłę maksymalną) z uwagi na przeciąganie przez łącznik umieszczony przy obrzeżu, Fk,ec, w zależności od: producenta systemu, rodzaju materiału termoizolacyjnego, jego grubości i wytrzymałości TR na rozciąganie prostopadle do powierzchni (względnie naprężenia ściskającego CS przy 10 % odkształceniu), sposobu montażu łączników (powierzchniowego albo zagłębionego), średnicy i sztywności talerzyka łącznika (jeśli podano); postępowaniem zachowawczym jest przyjęcie wartości jak dla łączników umieszczonych w spoinach, Fk,j (Rjoint),\n- na podstawie dokumentu ETA, dokumentu DoP albo karty technicznej systemu ociepleń ETICS, przyjąć wartość charakterystyczną nośności systemu (siłę niszczącą, siłę maksymalną) z uwagi na przeciąganie przez łącznik umieszczony w stykach płyt (spoinach), Fk,j (Rjoint), w zależności od: producenta systemu, rodzaju materiału termoizolacyjnego, jego grubości i wytrzymałości TR na rozciąganie prostopadle do powierzchni (względnie naprężenia ściskającego CS przy 10 % odkształceniu), sposobu montażu łączników (powierzchniowego albo zagłębionego), średnicy i sztywności talerzyka łącznika (jeśli podano),\n- w zależności od rodzaju materiału termoizolacyjnego, przyjąć wartość częściowego współczynnika bezpieczeństwa przy przeciąganiu łącznika przez płytę izolacyjną. W normie prEN 17237:2018 zamieszczono następujące zapisy dotyczące wartości tego współczynnika:\n• korek ekspandowany ICB - wartość deklarowana albo wartość domyślna bez sprawdzania, wynosząca 2,0,\n• pianka fenolowa PF - wartość deklarowana albo wartość domyślna bez sprawdzania, wynosząca 2,0,\n• polistyren ekspandowany EPS (styropian) - wartość deklarowana albo wartość domyślna bez sprawdzania, wynosząca 1,5,\n• polistyren ekstrudowany XPS - wartość deklarowana albo wartość domyślna bez sprawdzania, wynosząca 1,5,\n• szkło piankowe CG - wartość deklarowana albo wartość domyślna bez sprawdzania, wynosząca 1,5,\n• sztywna pianka poliuretanowa PU - wartość deklarowana albo wartość domyślna bez sprawdzania, wynosząca 1,5,\n• wełna mineralna MW - wartość deklarowana,\n• włókno drzewne WF - 1,85.\n\nWyniki obliczeń pokazane są w komórkach arkusza wyróżnionych kolorem żółtym, znajdujących się odpowiednio poniżej każdego schematu mocowania łącznikami. Są to:\n- liczba łączników przypadających na 1 m² ocieplenia, n,\n- wartość obliczeniowa nośności zespołu łączników na wyrywanie z podłoża, Rd,f,\n- wartość obliczeniowa nośności systemu ETICS na przeciąganie, Rd,ETICS,\n- wartość obliczeniowa nośności miarodajnej do sprawdzenia pierwszego stanu granicznego, Rd."]
{"$rows_empty":48}
[null,"Obliczanie oddziaływania wiatru we,d, gdy we wszystkich kierunkach występują takie same warunki"]
[]
[null,"Obliczenia wykonuje się w arkuszu kalkulacyjnym o nazwie „Obliczenia wiatr I”.\nW arkuszu tym uzyskuje się wartości oddziaływania wiatru w poszczególnych polach ścian bez uwzględnienia usytuowania budynku względem stron świata i wpływu sąsiedniej zabudowy.\nKomórki arkusza wymagające wstawienia wartości, sprawdzenia wartości przyjętej albo dokonania wyboru z listy rozwijanej, wyróżniono kolorem szarym.\n\nW celu przeprowadzenia obliczeń oddziaływania (ssania) wiatru na ściany budynku (we,d), należy:\n\n- wybrać z listy rozwijanej strefę obciążenia wiatrem w Polsce, właściwą lokalizacji rozpatrywanego budynku. Możliwy jest wybór zasadniczej strefy (1, 2 albo 3), a także strefy pośredniej pomiędzy strefami 1 i 2, obejmującej pas o szerokości 10 km po obu stronach granicy stref (zgodnie z zapisem w Załączniku krajowym NA normy PN-EN 1991-1-4:2008),\n- przyjąć wysokość nad poziomem morza miejsca lokalizacji rozpatrywanego budynku. Wysokość tą można określić wykorzystując np. stronę internetową: http://www.wysokosc.mapa.info.pl/\n- wybrać z listy rozwijanej kategorię terenu wokół miejsca lokalizacji rozpatrywanego budynku. W tym arkuszu kalkulacyjnym zakłada się, że we wszystkich kierunkach występuje teren takiej samej kategorii. Zgodnie z zapisem w Załączniku krajowym NA normy PN-EN 1991-1-4:2008, warunkiem zakwalifikowania terenu do określonej kategorii jest minimalna odległość od rozpatrywanej budowli do granicy terenu przyjętej kategorii, mierzona pod wiatr; powinna być ona nie mniejsza niż 30∙h, gdzie h jest wysokością budynku. Jeżeli budynek o wysokości h jest usytuowany bliżej niż 30∙h od początku terenu kategorii niższej niż ta, która go bezpośrednio otacza, to należy przyjmować, że jest zlokalizowany na terenie kategorii niższej.  Jeżeli na rozpatrywanym obszarze wokół budynku istnieje wybór między dwiema lub więcej kategoriami terenu, to wówczas należy wybrać teren o najniższej kategorii,\n- przyjąć wysokość rozpatrywanego budynku, h,\n- przyjąć szerokość (jeden z wymiarów rzutu) rozpatrywanego budynki, b,\n- przyjąć głębokość (drugi z wymiarów rzutu) rozpatrywanego budynku, d,\n- przyjąć wg listy rozwijanej wysokość odniesienia, do obliczeń oddziaływania wiatru. Zgodnie z zapisem normowym zaleca się, aby za wysokość odniesienia przyjąć wysokość budynku. Jeśli jednak w indywidualnym projekcie budynku podano, że rozkład oddziaływania wiatru na ścianach bocznych i zawietrznej może być taki sam, jak na ścianie nawietrznej, istnieje możliwość przyjęcia innych wysokości odniesienia, zależnie od proporcji h/b. Dlatego też lista rozwijana zmienia się w zależności od wymiarów h i b. Z opcji \"ze = ?, wpisz tu wartość\" należy skorzystać w przypadku przyjęcia wysokości pośredniej między ze = b oraz ze = h-b,  \n- przyjąć odpowiednią wartość współczynnika rzeźby terenu (orografii), co, w przypadku lokalizacji budynku na stoku albo w pobliżu wierzchołka stoku: klifu, skarpy, pojedynczego wzgórza albo pasma wzgórz. W celu obliczenia wartości współczynnika orografii, można posłużyć się na przykład arkuszami kalkulacyjnymi dołączonymi do książki: J.A. Żurański, M. Gaczek, Projektowanie według Eurokodów -- Oddziaływania klimatyczne na konstrukcje budowlane według Eurokodu 1 -- Komentarze z przykładami obliczeń; Instytut Techniki Budowlanej, Warszawa 2011. W pozostałych przypadkach, pozostawić wartość równą 1,0,\n- wybrać z listy rozwijanej, przyjmowaną do dalszych obliczeń wartość szczytowego ciśnienia prędkości wiatru. Możliwy jest wybór spośród trzech wartości, obliczonych wg:\n-- zasadniczej części normy PN-EN 1991-1-4:2008 (oznaczenie EN),\n-- Załącznika krajowego, przy wykorzystaniu współczynnika chropowatości terenu, z możliwością przyjęcia odpowiedniej wartości współczynnika orografii (oznaczenie NA, co ≥ 1),\n-- Załącznika krajowego, przy wykorzystaniu współczynnika ekspozycji, bez możliwości przyjęcia wartości współczynnika orografii większej od 1,0 (oznaczenie NA, co = 1),\n- sprawdzić i ewentualnie skorygować aktualnie obowiązującą wartość częściowego współczynnika bezpieczeństwa, podaną w PN-EN 1990,\n- w uzasadnionym przypadku, przyjąć wartość dodatkowego obciążenia prostopadłego do powierzchni.\n\nWyniki obliczeń pośrednich, mogących mieć znaczenie przy rozpatrywaniu oddziaływania wiatru, pokazane są w komórkach arkusza wyróżnionych kolorem jasnozielonym.\nWyniki obliczeń końcowych, pokazane są w komórkach arkusza wyróżnionych kolorem zielonym. Są to:\n- szerokości poszczególnych pól obciążenia ścian, przy oddziaływaniu wiatru z jednego kierunku,\n- wartości obliczeniowe podciśnienia (ssania) wiatru, w poszczególnych polach ścian, przy oddziaływaniu wiatru na ścianę o szerokości b, we,d,\n- szerokości poszczególnych pól obciążenia ścian, z uwzględnieniem czterech kierunków wiatru,\n- wartości obliczeniowe oddziaływania (ssania) wiatru w poszczególnych polach ścian, z uwzględnieniem czterech kierunków wiatru, we,d.\n\nWyniki końcowe przedstawiono także graficznie w zakładce „Wyniki graficzne wiatr I”."]
{"$rows_empty":52}
[null,"Obliczanie oddziaływania wiatru we,d, gdy w poszczególnych kierunkach występują inne warunki"]
[]
[null,"Obliczenia wykonuje się w arkuszu kalkulacyjnym o nazwie „Obliczenia wiatr II”. \nW arkuszu tym można uzyskać wartości oddziaływania wiatru z uwzględnieniem usytuowania budynku względem stron świata, różnych kategorii terenu w poszczególnych kierunkach lub z uwzględnieniem wpływu sąsiedniej zabudowy.\nKomórki arkusza wymagające wstawienia wartości, sprawdzenia wartości przyjętej albo dokonania wyboru z listy rozwijanej, wyróżniono kolorem szarym.\n\nW celu przeprowadzenia obliczeń oddziaływania (ssania) wiatru na ściany budynku (we,d), należy:\n\n- wybrać z listy rozwijanej strefę obciążenia wiatrem w Polsce, właściwą lokalizacji rozpatrywanego budynku. Możliwy jest wybór zasadniczej strefy (1, 2 albo 3), a także strefy pośredniej pomiędzy strefami 1 i 2, obejmującej pas o szerokości 10 km po obu stronach granicy stref (zgodnie z zapisem w Załączniku krajowym NA normy PN-EN 1991-1-4:2008),\n- przyjąć wysokość nad poziomem morza miejsca lokalizacji rozpatrywanego budynku. Wysokość tą można określić wykorzystując np. stronę internetową: http://www.wysokosc.mapa.info.pl/\n- przyjąć kąt odchylenia (zgodnie z ruchem wskazówek zegara) wybranej osi budynku od kierunku północnego. Kierunek ten równocześnie wyznaczy pierwszy rozpatrywany kierunek oddziaływania wiatru. Możliwe jest przyjęcie kąta od 0 do 360°, ale w praktyce, po osiągnięciu albo przekroczeniu kąta 90°, bliższa kierunkowi północnemu będzie druga oś budynku,\n- wybrać z listy rozwijanej kategorię terenu dla każdego z czterech zasadniczych kierunków wiatru, biorąc pod uwagę sektor kątowy o rozwartości 30°, obejmujący rozpatrywany kierunek. Zgodnie z zapisem w Załączniku krajowym NA normy PN-EN 1991-1-4:2008, warunkiem zakwalifikowania terenu do określonej kategorii jest minimalna odległość od rozpatrywanej budowli do granicy terenu przyjętej kategorii, mierzona pod wiatr; powinna być ona nie mniejsza niż 30∙h, gdzie h jest wysokością budynku. Jeżeli budynek o wysokości h jest usytuowany bliżej niż 30∙h od początku terenu kategorii niższej niż ta, która go bezpośrednio otacza, to należy przyjmować, że jest zlokalizowany na terenie kategorii niższej; odległości te należy wyznaczyć dla każdego z rozpatrywanych kierunków wiatru,\n- przyjąć wysokość rozpatrywanego budynku, h,\n- przyjąć szerokość (jeden z wymiarów rzutu) rozpatrywanego budynki, b,\n- przyjąć głębokość (drugi z wymiarów rzutu) rozpatrywanego budynku, d,\n- przyjąć wg listy rozwijanej wysokość odniesienia, do obliczeń oddziaływania wiatru. Zgodnie z zapisem normowym zaleca się, aby za wysokość odniesienia przyjąć wysokość budynku. Jeśli jednak w indywidualnym projekcie budynku podano, że rozkład oddziaływania wiatru na ścianach bocznych i zawietrznej może być taki sam, jak na ścianie nawietrznej, istnieje możliwość przyjęcia innych wysokości odniesienia, zależnie od proporcji h/b. Dlatego też lista rozwijana zmienia się w zależności od wymiarów h i b. Z opcji \"ze = ?, wpisz tu wartość\" należy skorzystać w przypadku przyjęcia wysokości pośredniej między ze = b oraz ze = h-b,\n- w przypadku przyjęcia terenu kategorii IV, rozważyć możliwość zmniejszenia wysokości odniesienia poprzez przyjęcie tzw. wysokości przemieszczenia, hdis. Wysokość tą można obliczyć w arkuszu „Wysokość przemieszczenia”,\n- w przypadku lokalizacji budynku na stoku albo w pobliżu wierzchołka stoku: klifu, skarpy, pojedynczego wzgórza albo pasma wzgórz, przyjąć w zależności od kierunku odpowiednią wartość współczynnika rzeźby terenu (orografii). W celu obliczenia wartości współczynnika orografii, można posłużyć się na przykład arkuszami kalkulacyjnymi dołączonymi do książki: J.A. Żurański, M. Gaczek, Projektowanie według Eurokodów -- Oddziaływania klimatyczne na konstrukcje budowlane według Eurokodu 1 -- Komentarze z przykładami obliczeń; Instytut Techniki Budowlanej, Warszawa 2011. W pozostałych przypadkach, pozostawić wartość równą 1,0,\n- wybrać z listy rozwijanej, przyjmowaną do dalszych obliczeń wartość szczytowego ciśnienia prędkości wiatru. Możliwy jest wybór spośród trzech wartości, obliczonych wg:\n-- zasadniczej części normy PN-EN 1991-1-4:2008 (oznaczenie EN),\n-- Załącznika krajowego, przy wykorzystaniu współczynnika chropowatości terenu, z możliwością przyjęcia odpowiedniej wartości współczynnika orografii (oznaczenie NA, co ≥ 1),\n-- Załącznika krajowego, przy wykorzystaniu współczynnika ekspozycji, bez możliwości przyjęcia wartości współczynnika orografii większej od 1,0 (oznaczenie NA, co = 1),\n- przyjąć wg listy rozwijanej wartości współczynnika ciśnienia zewnętrznego. Możliwy jest wybór spośród dwóch wartości domyślnych, a także przyjęcie innej wartości. Wartości domyślne to:\n-- wartości podstawowe, przyjmowane na podstawie normy PN-EN 1991-1-4:2008,\n-- wartości maksymalne przy zwężce, przyjmowane w nawiązaniu do Załącznika krajowego (NA) do normy BS EN 1991-1-4:2005+A1:2010.\nWartości maksymalne przy zwężce można przyjąć, gdy odległość między rozpatrywanym budynkiem, a budynkiem sąsiednim, mierzona prostopadle do rozpatrywanego średniego kierunku wiatru jest > e/4 i < e, gdzie e to wymiar mniejszy z dwóch: e=b albo 2h. W przypadku budynków o różnej wartości e, należy rozpatrywać wartość mniejszą. Przyjęcie wartości maksymalnej przy zwężce uwzględniane jest na obu ścianach równoległych do rozpatrywanego średniego kierunku wiatru. Jeśli efekt zwężki dotyczy tylko jednej z tych ścian, obliczenia należy wykonać dwukrotnie i wybrać ścianę podlegającą większemu oddziaływaniu wiatru w wyniku zwężenia przepływu,\n- sprawdzić i ewentualnie skorygować aktualnie obowiązującą wartość częściowego współczynnika bezpieczeństwa, podaną w PN-EN 1990,\n- w uzasadnionym przypadku, przyjąć wartość dodatkowego obciążenia prostopadłego do powierzchni.\n\nWyniki obliczeń pośrednich, mogących mieć znaczenie przy rozpatrywaniu oddziaływania wiatru, pokazane są w komórkach arkusza wyróżnionych kolorem jasnozielonym. Kolorem tym oznaczono także cztery przypadki oddziaływania wiatru.\nWyniki obliczeń końcowych, pokazane są w komórkach arkusza wyróżnionych kolorem zielonym. Są to:\n- szerokości poszczególnych pól obciążenia ścian, przy oddziaływaniu wiatru z jednego kierunku,\n- wartości obliczeniowe podciśnienia (ssania) wiatru, w poszczególnych polach ścian, przy oddziaływaniu wiatru na ścianę o szerokości b, we,d,\n\nWyniki końcowe, uwzględniające wszystkie cztery rozpatrywane kierunki wiatru, przedstawiono graficznie w zakładce „Wyniki graficzne wiatr II”."]
{"$rows_empty":63}
[null,"Określenie liczby łączników mechanicznych ze względu na nośność, przy oddziaływaniu wiatru I albo wiatru II"]
[]
[null,"Obliczenia wykonuje się w arkuszach kalkulacyjnych o nazwach: „Łączniki wiatr I” albo „Łączniki wiatr II”. \nNależy wybrać odpowiedni arkusz kalkulacyjny w zależności od przyjętego wcześniej wariantu oddziaływania wiatru („Obliczenia wiatr I” albo „Obliczenia wiatr II”).\nKomórki arkusza wymagające wstawienia wartości albo dokonania wyboru z listy rozwijanej, wyróżniono kolorem szarym.\n\nW celu przeprowadzenia obliczeń wymaganej liczby łączników ze względu na nośność, należy:\n\n- wybrać z listy rozwijanej rozpatrywany układ łączników (mocowanie na „T”, „W” albo „H”),\n- przyjąć minimalną liczbę łączników przypadających na 1 m² powierzchni systemu ETICS,\n- przyjąć dopuszczalne niedoszacowanie nośności (najczęściej do 3%) albo wpisać 0, jeśli nie dopuszcza się przekroczenia nośności.\n\nWyniki obliczeń pokazane są w formie pseudograficznej dla poszczególnych pól ścian. Są to:\n- wymagana liczba łączników przypadających na 1 m² ocieplenia, n,\n- numer schematu mocowania łącznikami, określony w odpowiednim arkuszu: „Obliczenia nośności T”, „Obliczenia nośności W” albo „Obliczenia nośności H” (numery podane są w górnej części każdego z arkuszy).\nJeśli z jakichś względów sugerowany schemat mocowania nie jest odpowiedni, można wybrać inny, spełniający warunek wymaganej liczby łączników.\n\nJeżeli nie sprawdza się przemieszczenia w miejscu mocowania łącznika, obliczenia kończą się."]
{"$rows_empty":19}
[null,"Określenie przemieszczenia δN w miejscu występowania łącznika, przy działaniu wiatru I albo wiatru II"]
[]
[null,"Obliczenia wykonuje się w arkuszach kalkulacyjnych o nazwach: „Przemieszczenia wiatr I” albo „Przemieszczenia wiatr II”. \nNależy wybrać odpowiedni arkusz kalkulacyjny w zależności od przyjętego wcześniej wariantu oddziaływania wiatru („Obliczenia wiatr I” albo „Obliczenia wiatr II”).\nKomórki arkusza wymagające wstawienia wartości, wyróżniono kolorem szarym.\n\nW celu przeprowadzenia obliczeń wymaganej liczby łączników ze względu na przemieszczenie w miejscu występowania łącznika, należy:\n\n- na podstawie dokumentu ETA (Europejskiej Aprobaty Technicznej, a po jej wygaśnięciu – Europejskiej Oceny Technicznej) albo karty technicznej wybranego wcześniej łącznika, przyjąć wartość przemieszczenia δm, w zależności od rodzaju podłoża, w którym łączniki będą osadzone,\n- na podstawie dokumentu ETA (Europejskiej Aprobaty Technicznej, a po jej wygaśnięciu – Europejskiej Oceny Technicznej) albo karty technicznej wybranego wcześniej łącznika, przyjąć wartość siły wyrywajacej N, w zależności od rodzaju podłoża, w którym łączniki będą osadzone,\n- przyjąć wartość przemieszczenia granicznego δN (w miejscu występowania łącznika). Wartością sugerowaną, wynikajacą z zapisów normy ÖNORM B 6400‐2:2017‐09 jest ⅓ mm.\n\nWyniki obliczeń pokazane są w formie pseudograficznej dla poszczególnych pól ścian. Są to:\n- przemieszczenie w miejscu występowania łącznika, obliczone przy założeniu równego rozdzielenia oddziaływania wiatru na łączniki, których liczbę określono ze względu na nośność,\n- minimalną wymaganą liczbę łączników przypadających na 1 m², z uwagi na nieprzekroczenie wartości przemieszczenia granicznego."]
{"$rows_empty":19}
[null,"Wymagana liczba łączników ze względu na nośność i przemieszczenie, przy oddziaływaniu wiatru I albo wiatru II"]
[]
[null,"Końcowe wyniki obliczeń pokazane są w arkuszach o nazwach: „Wyniki końcowe wiatr I” albo „Wyniki końcowe wiatr II”. \nNależy wybrać odpowiedni arkusz w zależności od przyjętego wcześniej wariantu oddziaływania wiatru („Obliczenia wiatr I” albo „Obliczenia wiatr II”).\n\nW górnej części arkuszy podane są przyjęte wcześniej warunki obliczeń:\n\n- rozpatrywany układ łączników (mocowanie na „T”, „W” albo „H”),\n- minimalna liczba łączników przypadających na 1 m² powierzchni systemu ETICS,\n- przemieszczenie graniczne w miejscu występowania łącznika.\n\nWyniki obliczeń pokazane są w formie pseudograficznej dla poszczególnych pól ścian. Są to:\n- wymagana, ze wzgledu na nośność i przemieszczenie, liczba łączników przypadających na 1 m² ocieplenia,\n- numer schematu mocowania łącznikami, określony w odpowiednim arkuszu: „Obliczenia nośności T”, „Obliczenia nośności W” albo „Obliczenia nośności H” (numery podane są w górnej części każdego z arkuszy).\nJeśli z jakichś względów sugerowany schemat mocowania nie jest odpowiedni, można wybrać inny, spełniający warunek wymaganej liczby łączników."]

{"sheet":"Obliczenia nośności T","index":2,"n_rows":77,"n_cols":20,"rows_kept":77,"merged":[[1,1,2,6],[33,1,34,1],[35,1,36,1],[38,1,39,1]]}
[]
[null,"Obliczanie nośności łączników mechanicznych Rd,f, nośności systemu ETICS Rd,ETICS oraz nośności miarodajnej Rd"]
[]
[]
[null,"Numer schematu mocowania łącznikami mechanicznymi","→",1,2,3,4,5,6,7,8,9,10,11,12,13,14,15,16,17]
[null,"Schemat mocowania łącznikami mechanicznymi","→",null,"Na przemian schematy 1 i 3",null,"Na przemian schematy 3 i 5",null,"Na przemian schematy 5 i 7",null,"Na przemian schematy 7 i 9",null,null,"Na przemian schematy 9 i 13","Na przemian schematy 10 i 14",null,null,"Na przemian schematy 14 i 16",null,"Inny"]
[null,"Wymiary płyt termoizolacyjnych"]
[null,"- długość, m",{"v":1,"d":"1.00"},{"$f":"C8","v":{"v":1,"d":"1.00"}},{"$f":"C8","v":{"v":1,"d":"1.00"}},{"$f":"C8","v":{"v":1,"d":"1.00"}},{"$f":"C8","v":{"v":1,"d":"1.00"}},{"$f":"C8","v":{"v":1,"d":"1.00"}},{"$f":"C8","v":{"v":1,"d":"1.00"}},{"$f":"C8","v":{"v":1,"d":"1.00"}},{"$f":"C8","v":{"v":1,"d":"1.00"}},{"$f":"C8","v":{"v":1,"d":"1.00"}},{"$f":"C8","v":{"v":1,"d":"1.00"}},{"$f":"C8","v":{"v":1,"d":"1.00"}},{"$f":"C8","v":{"v":1,"d":"1.00"}},{"$f":"C8","v":{"v":1,"d":"1.00"}},{"$f":"C8","v":{"v":1,"d":"1.00"}},{"$f":"C8","v":{"v":1,"d":"1.00"}},{"$f":"C8","v":{"v":1,"d":"1.00"}},{"$f":"C8","v":{"v":1,"d":"1.00"}}]
[null,"- szerokość, m",{"v":0.5,"d":"0.50"},{"$f":"C9","v":{"v":0.5,"d":"0.50"}},{"$f":"C9","v":{"v":0.5,"d":"0.50"}},{"$f":"C9","v":{"v":0.5,"d":"0.50"}},{"$f":"C9","v":{"v":0.5,"d":"0.50"}},{"$f":"C9","v":{"v":0.5,"d":"0.50"}},{"$f":"C9","v":{"v":0.5,"d":"0.50"}},{"$f":"C9","v":{"v":0.5,"d":"0.50"}},{"$f":"C9","v":{"v":0.5,"d":"0.50"}},{"$f":"C9","v":{"v":0.5,"d":"0.50"}},{"$f":"C9","v":{"v":0.5,"d":"0.50"}},{"$f":"C9","v":{"v":0.5,"d":"0.50"}},{"$f":"C9","v":{"v":0.5,"d":"0.50"}},{"$f":"C9","v":{"v":0.5,"d":"0.50"}},{"$f":"C9","v":{"v":0.5,"d":"0.50"}},{"$f":"C9","v":{"v":0.5,"d":"0.50"}},{"$f":"C9","v":{"v":0.5,"d":"0.50"}},{"$f":"C9","v":{"v":0.5,"d":"0.50"}}]
[null,"Liczba łączników na jedną płytę, szt","→",{"$f":"D11+D12","v":{"v":2,"d":"2.00"}},{"$f":"E11+E12","v":{"v":2.5,"d":"2.50"}},{"v":3,"d":"3.00"},{"v":3.5,"d":"3.50"},{"v":4,"d":"4.00"},{"v":4.5,"d":"4.50"},{"v":5,"d":"5.00"},{"v":5.5,"d":"5.50"},{"v":6,"d":"6.00"},{"v":6,"d":"6.00"},{"v":6.5,"d":"6.50"},{"v":6.5,"d":"6.50"},{"v":7,"d":"7.00"},{"v":7,"d":"7.00"},{"v":7.5,"d":"7.50"},{"v":8,"d":"8.00"},{"$f":"T11+T12","v":{"v":5,"d":"5.00"}}]
[null,"Liczba łączników na jedną płytę umieszczonych w polu płyty, szt","→",{"v":0,"d":"0.00"},{"v":0.5,"d":"0.50"},{"v":1,"d":"1.00"},{"v":1.5,"d":"1.50"},{"v":2,"d":"2.00"},{"v":2.5,"d":"2.50"},{"v":3,"d":"3.00"},{"v":3.5,"d":"3.50"},{"v":4,"d":"4.00"},{"v":3,"d":"3.00"},{"v":4.5,"d":"4.50"},{"v":3.5,"d":"3.50"},{"v":5,"d":"5.00"},{"v":4,"d":"4.00"},{"v":4.5,"d":"4.50"},{"v":5,"d":"5.00"},{"v":2,"d":"2.00"}]
[null,"Liczba łączników na jedną płytę umieszczonych w spoinach, szt","→",{"v":2,"d":"2.00"},{"v":2,"d":"2.00"},{"v":2,"d":"2.00"},{"v":2,"d":"2.00"},{"v":2,"d":"2.00"},{"v":2,"d":"2.00"},{"v":2,"d":"2.00"},{"v":2,"d":"2.00"},{"v":2,"d":"2.00"},{"v":3,"d":"3.00"},{"v":2,"d":"2.00"},{"v":3,"d":"3.00"},{"v":2,"d":"2.00"},{"v":3,"d":"3.00"},{"v":3,"d":"3.00"},{"v":3,"d":"3.00"},{"v":3,"d":"3.00"}]
[null,"Liczba łączników na m², n, szt","→",{"$f":"D10/(D8*D9)","v":{"v":4,"d":"4.00"}},{"v":5,"d":"5.00"},{"v":6,"d":"6.00"},{"v":7,"d":"7.00"},{"v":8,"d":"8.00"},{"v":9,"d":"9.00"},{"v":10,"d":"10.00"},{"v":11,"d":"11.00"},{"v":12,"d":"12.00"},{"v":12,"d":"12.00"},{"v":13,"d":"13.00"},{"v":13,"d":"13.00"},{"v":14,"d":"14.00"},{"v":14,"d":"14.00"},{"v":15,"d":"15.00"},{"v":16,"d":"16.00"},{"v":10,"d":"10.00"}]
[null,"Liczba łączników umieszczonych w polu płyt, na (npanel), szt/m²","→",{"$f":"D11/(D8*D9)","v":{"v":0,"d":"0.00"}},{"v":1,"d":"1.00"},{"v":2,"d":"2.00"},{"v":3,"d":"3.00"},{"v":4,"d":"4.00"},{"v":5,"d":"5.00"},{"v":6,"d":"6.00"},{"v":7,"d":"7.00"},{"v":8,"d":"8.00"},{"v":6,"d":"6.00"},{"v":9,"d":"9.00"},{"v":7,"d":"7.00"},{"v":10,"d":"10.00"},{"v":8,"d":"8.00"},{"v":9,"d":"9.00"},{"v":10,"d":"10.00"},{"v":4,"d":"4.00"}]
[null,"Liczba łączników umieszczonych w spoinach, nj (njoint), szt/m²","→",{"$f":"D12/(D8*D9)","v":{"v":4,"d":"4.00"}},{"v":4,"d":"4.00"},{"v":4,"d":"4.00"},{"v":4,"d":"4.00"},{"v":4,"d":"4.00"},{"v":4,"d":"4.00"},{"v":4,"d":"4.00"},{"v":4,"d":"4.00"},{"v":4,"d":"4.00"},{"v":6,"d":"6.00"},{"v":4,"d":"4.00"},{"v":6,"d":"6.00"},{"v":4,"d":"4.00"},{"v":6,"d":"6.00"},{"v":6,"d":"6.00"},{"v":6,"d":"6.00"},{"v":6,"d":"6.00"}]
[]
[null,"Wyrywanie łączników z podłoża"]
[null,"Nośność charakterystyczna pojedynczego łącznika na wyrywanie z podłoża NR,k, kN",{"v":1.2,"d":"1.20"},{"$f":"C18","v":{"v":1.2,"d":"1.20"}},{"$f":"C18","v":{"v":1.2,"d":"1.20"}},{"$f":"C18","v":{"v":1.2,"d":"1.20"}},{"$f":"C18","v":{"v":1.2,"d":"1.20"}},{"$f":"C18","v":{"v":1.2,"d":"1.20"}},{"$f":"C18","v":{"v":1.2,"d":"1.20"}},{"$f":"C18","v":{"v":1.2,"d":"1.20"}},{"$f":"C18","v":{"v":1.2,"d":"1.20"}},{"$f":"C18","v":{"v":1.2,"d":"1.20"}},{"$f":"C18","v":{"v":1.2,"d":"1.20"}},{"$f":"C18","v":{"v":1.2,"d":"1.20"}},{"$f":"C18","v":{"v":1.2,"d":"1.20"}},{"$f":"C18","v":{"v":1.2,"d":"1.20"}},{"$f":"C18","v":{"v":1.2,"d":"1.20"}},{"$f":"C18","v":{"v":1.2,"d":"1.20"}},{"$f":"C18","v":{"v":1.2,"d":"1.20"}},{"$f":"C18","v":{"v":1.2,"d":"1.20"}}]
[null,"Częściowy współczynnik bezpieczeństwa, -",{"v":2,"d":"2.00"},{"$f":"C19","v":{"v":2,"d":"2.00"}},{"$f":"C19","v":{"v":2,"d":"2.00"}},{"$f":"C19","v":{"v":2,"d":"2.00"}},{"$f":"C19","v":{"v":2,"d":"2.00"}},{"$f":"C19","v":{"v":2,"d":"2.00"}},{"$f":"C19","v":{"v":2,"d":"2.00"}},{"$f":"C19","v":{"v":2,"d":"2.00"}},{"$f":"C19","v":{"v":2,"d":"2.00"}},{"$f":"C19","v":{"v":2,"d":"2.00"}},{"$f":"C19","v":{"v":2,"d":"2.00"}},{"$f":"C19","v":{"v":2,"d":"2.00"}},{"$f":"C19","v":{"v":2,"d":"2.00"}},{"$f":"C19","v":{"v":2,"d":"2.00"}},{"$f":"C19","v":{"v":2,"d":"2.00"}},{"$f":"C19","v":{"v":2,"d":"2.00"}},{"$f":"C19","v":{"v":2,"d":"2.00"}},{"$f":"C19","v":{"v":2,"d":"2.00"}}]
[null,"Nośność obliczeniowa łączników na wyrywanie z podłoża Rd,f, kN/m²","→",{"$f":"((D14+D15)*D18)/D19","v":{"v":2.4,"d":"2.40"}},{"v":3,"d":"3.00"},{"v":3.5999999999999996,"d":"3.60"},{"v":4.2,"d":"4.20"},{"v":4.8,"d":"4.80"},{"v":5.3999999999999995,"d":"5.40"},{"v":6,"d":"6.00"},{"v":6.6,"d":"6.60"},{"v":7.199999999999999,"d":"7.20"},{"v":7.199999999999999,"d":"7.20"},{"v":7.8,"d":"7.80"},{"v":7.8,"d":"7.80"},{"v":8.4,"d":"8.40"},{"v":8.4,"d":"8.40"},{"v":9,"d":"9.00"},{"v":9.6,"d":"9.60"},{"v":6,"d":"6.00"}]
[]
[null,"Przeciąganie płyt przez łączniki"]
[null,"Nośność charakterystyczna (siła niszcząca) na przeciąganie przez łącznik umieszczony w polu płyty, Fk,a (Rpanel), kN",0.48,{"$f":"C23","v":0.48},{"$f":"C23","v":0.48},{"$f":"C23","v":0.48},{"$f":"C23","v":0.48},{"$f":"C23","v":0.48},{"$f":"C23","v":0.48},{"$f":"C23","v":0.48},{"$f":"C23","v":0.48},{"$f":"C23","v":0.48},{"$f":"C23","v":0.48},{"$f":"C23","v":0.48},{"$f":"C23","v":0.48},{"$f":"C23","v":0.48},{"$f":"C23","v":0.48},{"$f":"C23","v":0.48},{"$f":"C23","v":0.48},{"$f":"C23","v":0.48}]
[null,"Nośność charakterystyczna (siła niszcząca) na przeciąganie przez łącznik umieszczony w stykach płyt (spoinach), Fk,j (Rjoint), kN",0.39,{"$f":"C24","v":0.39},{"$f":"C24","v":0.39},{"$f":"C24","v":0.39},{"$f":"C24","v":0.39},{"$f":"C24","v":0.39},{"$f":"C24","v":0.39},{"$f":"C24","v":0.39},{"$f":"C24","v":0.39},{"$f":"C24","v":0.39},{"$f":"C24","v":0.39},{"$f":"C24","v":0.39},{"$f":"C24","v":0.39},{"$f":"C24","v":0.39},{"$f":"C24","v":0.39},{"$f":"C24","v":0.39},{"$f":"C24","v":0.39},{"$f":"C24","v":0.39}]
[null,"Częściowy współczynnik bezpieczeństwa, -",{"v":1.5,"d":"1.50"},{"$f":"C25","v":{"v":1.5,"d":"1.50"}},{"$f":"C25","v":{"v":1.5,"d":"1.50"}},{"$f":"C25","v":{"v":1.5,"d":"1.50"}},{"$f":"C25","v":{"v":1.5,"d":"1.50"}},{"$f":"C25","v":{"v":1.5,"d":"1.50"}},{"$f":"C25","v":{"v":1.5,"d":"1.50"}},{"$f":"C25","v":{"v":1.5,"d":"1.50"}},{"$f":"C25","v":{"v":1.5,"d":"1.50"}},{"$f":"C25","v":{"v":1.5,"d":"1.50"}},{"$f":"C25","v":{"v":1.5,"d":"1.50"}},{"$f":"C25","v":{"v":1.5,"d":"1.50"}},{"$f":"C25","v":{"v":1.5,"d":"1.50"}},{"$f":"C25","v":{"v":1.5,"d":"1.50"}},{"$f":"C25","v":{"v":1.5,"d":"1.50"}},{"$f":"C25","v":{"v":1.5,"d":"1.50"}},{"$f":"C25","v":{"v":1.5,"d":"1.50"}},{"$f":"C25","v":{"v":1.5,"d":"1.50"}}]
[null,"Nośność obliczeniowa systemu ETICS na przeciąganie Rd,ETICS, kN/m²","→",{"$f":"(D23*D14+D24*D15)/D25","v":1.04},1.36,1.68,{"v":2,"d":"2.00"},2.32,2.64,{"v":2.9599999999999995,"d":"2.96"},{"$f":"(K23*K14)/K25","v":{"v":2.2399999999999998,"d":"2.24"}},{"$f":"(L23*L14+L24*L15)/L25","v":{"v":3.6,"d":"3.60"}},3.48,{"v":3.9200000000000004,"d":"3.92"},{"v":3.7999999999999994,"d":"3.80"},{"v":4.239999999999999,"d":"4.24"},4.12,4.44,4.76,2.84]
[]
[null,"Łączne uwzględnienie wyrywania i przeciągania"]
[null,"Nośność obliczeniowa miarodajna  Rd, kN/m²",null,{"$f":" D14*MIN(D23/D25,D18/D19)+D15*MIN(D24/D25,D18/D19)","v":1.04},1.36,{"v":1.6800000000000002,"d":"1.68"},{"v":2,"d":"2.00"},{"v":2.3200000000000003,"d":"2.32"},2.64,2.96,{"v":3.2800000000000002,"d":"3.28"},{"v":3.6,"d":"3.60"},3.48,3.92,{"v":3.8000000000000003,"d":"3.80"},4.24,4.12,{"v":4.4399999999999995,"d":"4.44"},4.76,2.84]
[]
[]
[]
[null,"Należy spełnić warunki:"]
[null,"Rd   ≥   we,d"]
[]
[null,"δ   ≥   δN"]
[]
[null,"oraz"]
[null,"n   ≥   nmin"]
{"$rows_empty":17}
[null,null,0]
[null,null,0.5]
[null,null,1]
[null,null,1.5]
[null,null,2]
[null,null,2.5]
[null,null,3]
[null,null,3.5]
[null,null,4]
[null,null,4.5]
[null,null,5]
[null,null,5.5]
[null,null,6]
[null,null,6.5]
[null,null,7]
[null,null,7.5]
[null,null,8]
[null,null,8.5]
[null,null,9]
[null,null,9.5]
[null,null,10]

{"sheet":"Obliczenia nośności W","index":3,"n_rows":77,"n_cols":17,"rows_kept":77,"merged":[[1,1,2,6],[33,1,34,1],[35,1,36,1],[38,1,39,1]]}
[]
[null,"Obliczanie nośności łączników mechanicznych Rd,f, nośności systemu ETICS Rd,ETICS oraz nośności miarodajnej Rd"]
[]
[]
[null,"Numer schematu mocowania łącznikami mechanicznymi","→",1,2,3,4,5,6,7,8,9,10,11,12,13,14]
[null,"Schemat mocowania łącznikami mechanicznymi","→",null,"Na przemian schematy 1 i 3",null,"Na przemian schematy 3 i 5",null,"Na przemian schematy 5 i 7",null,"Na przemian schematy 7 i 9",null,"Na przemian schematy 9 i 11",null,"Na przemian schematy 11 i 13",null,"Inny"]
[null,"Wymiary płyt termoizolacyjnych"]
[null,"- długość, m",{"v":1,"d":"1.00"},{"$f":"C8","v":{"v":1,"d":"1.00"}},{"$f":"C8","v":{"v":1,"d":"1.00"}},{"$f":"C8","v":{"v":1,"d":"1.00"}},{"$f":"C8","v":{"v":1,"d":"1.00"}},{"$f":"C8","v":{"v":1,"d":"1.00"}},{"$f":"C8","v":{"v":1,"d":"1.00"}},{"$f":"C8","v":{"v":1,"d":"1.00"}},{"$f":"C8","v":{"v":1,"d":"1.00"}},{"$f":"C8","v":{"v":1,"d":"1.00"}},{"$f":"C8","v":{"v":1,"d":"1.00"}},{"$f":"C8","v":{"v":1,"d":"1.00"}},{"$f":"C8","v":{"v":1,"d":"1.00"}},{"$f":"C8","v":{"v":1,"d":"1.00"}},{"$f":"C8","v":{"v":1,"d":"1.00"}}]
[null,"- szerokość, m",{"v":0.6,"d":"0.60"},{"$f":"C9","v":{"v":0.6,"d":"0.60"}},{"$f":"C9","v":{"v":0.6,"d":"0.60"}},{"$f":"C9","v":{"v":0.6,"d":"0.60"}},{"$f":"C9","v":{"v":0.6,"d":"0.60"}},{"$f":"C9","v":{"v":0.6,"d":"0.60"}},{"$f":"C9","v":{"v":0.6,"d":"0.60"}},{"$f":"C9","v":{"v":0.6,"d":"0.60"}},{"$f":"C9","v":{"v":0.6,"d":"0.60"}},{"$f":"C9","v":{"v":0.6,"d":"0.60"}},{"$f":"C9","v":{"v":0.6,"d":"0.60"}},{"$f":"C9","v":{"v":0.6,"d":"0.60"}},{"$f":"C9","v":{"v":0.6,"d":"0.60"}},{"$f":"C9","v":{"v":0.6,"d":"0.60"}},{"$f":"C9","v":{"v":0.6,"d":"0.60"}}]
[null,"Liczba łączników na jedną płytę, szt","→",{"$f":"D11+D12","v":{"v":2,"d":"2.00"}},{"$f":"E11+E12","v":{"v":2.5,"d":"2.50"}},{"v":3,"d":"3.00"},{"v":3.5,"d":"3.50"},{"v":4,"d":"4.00"},{"v":4.5,"d":"4.50"},{"v":5,"d":"5.00"},{"v":5.5,"d":"5.50"},{"v":6,"d":"6.00"},{"v":6.5,"d":"6.50"},{"v":7,"d":"7.00"},{"v":7.5,"d":"7.50"},{"v":8,"d":"8.00"},{"$f":"Q11+Q12","v":{"v":2,"d":"2.00"}}]
[null,"Liczba łączników na jedną płytę umieszczonych w polu płyty, szt","→",{"v":0,"d":"0.00"},{"v":0,"d":"0.00"},{"v":0,"d":"0.00"},{"v":0,"d":"0.00"},{"v":0,"d":"0.00"},{"v":0,"d":"0.00"},{"v":0,"d":"0.00"},{"v":0,"d":"0.00"},{"v":0,"d":"0.00"},{"v":0.5,"d":"0.50"},{"v":1,"d":"1.00"},{"v":1.5,"d":"1.50"},{"v":2,"d":"2.00"},{"v":2,"d":"2.00"}]
[null,"Liczba łączników na jedną płytę umieszczonych przy obrzeżach, szt","→",{"v":2,"d":"2.00"},{"v":2.5,"d":"2.50"},{"v":3,"d":"3.00"},{"v":3.5,"d":"3.50"},{"v":4,"d":"4.00"},{"v":4.5,"d":"4.50"},{"v":5,"d":"5.00"},{"v":5.5,"d":"5.50"},{"v":6,"d":"6.00"},{"v":6,"d":"6.00"},{"v":6,"d":"6.00"},{"v":6,"d":"6.00"},{"v":6,"d":"6.00"},{"v":0,"d":"0.00"}]
[null,"Liczba łączników na m², n, szt","→",{"$f":"D10/(D8*D9)","v":{"v":3.3333333333333335,"d":"3.33"}},{"v":4.166666666666667,"d":"4.17"},{"v":5,"d":"5.00"},{"v":5.833333333333334,"d":"5.83"},{"v":6.666666666666667,"d":"6.67"},{"v":7.5,"d":"7.50"},{"v":8.333333333333334,"d":"8.33"},{"v":9.166666666666668,"d":"9.17"},{"v":10,"d":"10.00"},{"v":10.833333333333334,"d":"10.83"},{"v":11.666666666666668,"d":"11.67"},{"v":12.5,"d":"12.50"},{"v":13.333333333333334,"d":"13.33"},{"v":3.3333333333333335,"d":"3.33"}]
[null,"Liczba łączników umieszczonych w polu płyt, na, szt/m²","→",{"$f":"D11/(D8*D9)","v":{"v":0,"d":"0.00"}},{"v":0,"d":"0.00"},{"v":0,"d":"0.00"},{"v":0,"d":"0.00"},{"v":0,"d":"0.00"},{"v":0,"d":"0.00"},{"v":0,"d":"0.00"},{"v":0,"d":"0.00"},{"v":0,"d":"0.00"},{"v":0.8333333333333334,"d":"0.83"},{"v":1.6666666666666667,"d":"1.67"},{"v":2.5,"d":"2.50"},{"v":3.3333333333333335,"d":"3.33"},{"v":3.3333333333333335,"d":"3.33"}]
[null,"Liczba łączników umieszczonych przy obreżach, nec, szt/m²","→",{"$f":"D12/(D8*D9)","v":{"v":3.3333333333333335,"d":"3.33"}},{"v":4.166666666666667,"d":"4.17"},{"v":5,"d":"5.00"},{"v":5.833333333333334,"d":"5.83"},{"v":6.666666666666667,"d":"6.67"},{"v":7.5,"d":"7.50"},{"v":8.333333333333334,"d":"8.33"},{"v":9.166666666666668,"d":"9.17"},{"v":10,"d":"10.00"},{"v":10,"d":"10.00"},{"v":10,"d":"10.00"},{"v":10,"d":"10.00"},{"v":10,"d":"10.00"},{"v":0,"d":"0.00"}]
[]
[null,"Wyrywanie łączników z podłoża"]
[null,"Nośność charakterystyczna pojedynczego łącznika na wyrywanie z podłoża NR,k, kN",{"v":1.2,"d":"1.20"},{"$f":"C18","v":{"v":1.2,"d":"1.20"}},{"$f":"C18","v":{"v":1.2,"d":"1.20"}},{"$f":"C18","v":{"v":1.2,"d":"1.20"}},{"$f":"C18","v":{"v":1.2,"d":"1.20"}},{"$f":"C18","v":{"v":1.2,"d":"1.20"}},{"$f":"C18","v":{"v":1.2,"d":"1.20"}},{"$f":"C18","v":{"v":1.2,"d":"1.20"}},{"$f":"C18","v":{"v":1.2,"d":"1.20"}},{"$f":"C18","v":{"v":1.2,"d":"1.20"}},{"$f":"C18","v":{"v":1.2,"d":"1.20"}},{"$f":"C18","v":{"v":1.2,"d":"1.20"}},{"$f":"C18","v":{"v":1.2,"d":"1.20"}},{"$f":"C18","v":{"v":1.2,"d":"1.20"}},{"$f":"C18","v":{"v":1.2,"d":"1.20"}}]
[null,"Częściowy współczynnik bezpieczeństwa, -",{"v":2,"d":"2.00"},{"$f":"C19","v":{"v":2,"d":"2.00"}},{"$f":"C19","v":{"v":2,"d":"2.00"}},{"$f":"C19","v":{"v":2,"d":"2.00"}},{"$f":"C19","v":{"v":2,"d":"2.00"}},{"$f":"C19","v":{"v":2,"d":"2.00"}},{"$f":"C19","v":{"v":2,"d":"2.00"}},{"$f":"C19","v":{"v":2,"d":"2.00"}},{"$f":"C19","v":{"v":2,"d":"2.00"}},{"$f":"C19","v":{"v":2,"d":"2.00"}},{"$f":"C19","v":{"v":2,"d":"2.00"}},{"$f":"C19","v":{"v":2,"d":"2.00"}},{"$f":"C19","v":{"v":2,"d":"2.00"}},{"$f":"C19","v":{"v":2,"d":"2.00"}},{"$f":"C19","v":{"v":2,"d":"2.00"}}]
[null,"Nośność obliczeniowa łączników na wyrywanie z podłoża Rd,f, kN/m²","→",{"$f":"((D14+D15)*D18)/D19","v":{"v":2,"d":"2.00"}},{"v":2.5,"d":"2.50"},{"v":3,"d":"3.00"},{"v":3.5000000000000004,"d":"3.50"},{"v":4,"d":"4.00"},{"v":4.5,"d":"4.50"},{"v":5,"d":"5.00"},{"v":5.500000000000001,"d":"5.50"},{"v":6,"d":"6.00"},{"v":6.5,"d":"6.50"},{"v":6.999999999999999,"d":"7.00"},{"v":7.5,"d":"7.50"},{"v":8,"d":"8.00"},{"v":2,"d":"2.00"}]
[]
[null,"Przeciąganie płyt przez łączniki"]
[null,"Nośność charakterystyczna (siła niszcząca) na przeciąganie przez łącznik umieszczony w polu płyty, Fk,a (Rpanel), kN",0.41,{"$f":"C23","v":0.41},{"$f":"C23","v":0.41},{"$f":"C23","v":0.41},{"$f":"C23","v":0.41},{"$f":"C23","v":0.41},{"$f":"C23","v":0.41},{"$f":"C23","v":0.41},{"$f":"C23","v":0.41},{"$f":"C23","v":0.41},{"$f":"C23","v":0.41},{"$f":"C23","v":0.41},{"$f":"C23","v":0.41},{"$f":"C23","v":0.41},{"$f":"C23","v":0.41}]
[null,"Nośność charakterystyczna (siła niszcząca) na przeciąganie przez łącznik umieszczony przy obrzeżach, Fk,ec, albo w polu płyty, Fk,a, kN",0.37,{"$f":"C24","v":0.37},{"$f":"C24","v":0.37},{"$f":"C24","v":0.37},{"$f":"C24","v":0.37},{"$f":"C24","v":0.37},{"$f":"C24","v":0.37},{"$f":"C24","v":0.37},{"$f":"C24","v":0.37},{"$f":"C24","v":0.37},{"$f":"C24","v":0.37},{"$f":"C24","v":0.37},{"$f":"C24","v":0.37},{"$f":"C24","v":0.37},{"$f":"C24","v":0.37}]
[null,"Częściowy współczynnik bezpieczeństwa, -",{"v":2,"d":"2.00"},{"$f":"C25","v":{"v":2,"d":"2.00"}},{"$f":"C25","v":{"v":2,"d":"2.00"}},{"$f":"C25","v":{"v":2,"d":"2.00"}},{"$f":"C25","v":{"v":2,"d":"2.00"}},{"$f":"C25","v":{"v":2,"d":"2.00"}},{"$f":"C25","v":{"v":2,"d":"2.00"}},{"$f":"C25","v":{"v":2,"d":"2.00"}},{"$f":"C25","v":{"v":2,"d":"2.00"}},{"$f":"C25","v":{"v":2,"d":"2.00"}},{"$f":"C25","v":{"v":2,"d":"2.00"}},{"$f":"C25","v":{"v":2,"d":"2.00"}},{"$f":"C25","v":{"v":2,"d":"2.00"}},{"$f":"C25","v":{"v":2,"d":"2.00"}},{"$f":"C25","v":{"v":2,"d":"2.00"}}]
[null,"Nośność obliczeniowa systemu ETICS na przeciąganie Rd,ETICS, kN/m²","→",{"$f":"(D23*D14+D24*D15)/D25","v":{"v":0.6166666666666667,"d":"0.62"}},{"v":0.7708333333333334,"d":"0.77"},{"v":0.925,"d":"0.93"},{"v":1.0791666666666668,"d":"1.08"},{"v":1.2333333333333334,"d":"1.23"},{"v":1.3875,"d":"1.39"},{"v":1.5416666666666667,"d":"1.54"},{"$f":"(K23*K14)/K25","v":{"v":0,"d":"0.00"}},{"$f":"(L23*L14+L24*L15)/L25","v":1.85},{"v":2.0208333333333335,"d":"2.02"},{"v":2.191666666666667,"d":"2.19"},{"v":2.3625,"d":"2.36"},{"v":2.533333333333333,"d":"2.53"},{"v":0.6833333333333333,"d":"0.68"}]
[]
[null,"Łączne uwzględnienie wyrywania i przeciągania"]
[null,"Nośność obliczeniowa miarodajna  Rd, kN/m²",null,{"$f":" D14*MIN(D23/D25,D18/D19)+D15*MIN(D24/D25,D18/D19)","v":{"v":0.6166666666666667,"d":"0.62"}},{"v":0.7708333333333334,"d":"0.77"},{"v":0.925,"d":"0.93"},{"v":1.0791666666666668,"d":"1.08"},{"v":1.2333333333333334,"d":"1.23"},{"v":1.3875,"d":"1.39"},{"v":1.5416666666666667,"d":"1.54"},{"v":1.6958333333333335,"d":"1.70"},1.85,{"v":2.0208333333333335,"d":"2.02"},{"v":2.191666666666667,"d":"2.19"},{"v":2.3625,"d":"2.36"},{"v":2.533333333333333,"d":"2.53"},{"v":0.6833333333333333,"d":"0.68"}]
[]
[]
[]
[null,"Należy spełnić warunki:"]
[null,"Rd   ≥   we,d"]
[]
[null,"δ   ≥   δN"]
[]
[null,"oraz"]
[null,"n   ≥   nmin"]
{"$rows_empty":17}
[null,null,0]
[null,null,0.5]
[null,null,1]
[null,null,1.5]
[null,null,2]
[null,null,2.5]
[null,null,3]
[null,null,3.5]
[null,null,4]
[null,null,4.5]
[null,null,5]
[null,null,5.5]
[null,null,6]
[null,null,6.5]
[null,null,7]
[null,null,7.5]
[null,null,8]
[null,null,8.5]
[null,null,9]
[null,null,9.5]
[null,null,10]

{"sheet":"Obliczenia nośności H","index":4,"n_rows":91,"n_cols":23,"rows_kept":91,"merged":[[1,1,2,6],[47,1,48,1],[49,1,50,1],[52,1,53,1]]}
[]
[null,"Obliczanie nośności łączników mechanicznych Rd,f, nośności systemu ETICS Rd,ETICS oraz nośności miarodajnej Rd"]
[]
[]
[null,"Numer schematu mocowania łącznikami mechanicznymi","→",1,2,3,4,5,6,7,8,9,10,11,12,13,14,15,16,17,18,19,20]
[null,"Schemat mocowania łącznikami mechanicznymi","→",{"$nulls":19},"Inny"]
[null,"Wymiary płyt termoizolacyjnych"]
[null,"- długość, m",{"v":1.2,"d":"1.20"},{"$f":"C8","v":{"v":1.2,"d":"1.20"}},{"$f":"C8","v":{"v":1.2,"d":"1.20"}},{"$f":"C8","v":{"v":1.2,"d":"1.20"}},{"$f":"C8","v":{"v":1.2,"d":"1.20"}},{"$f":"C8","v":{"v":1.2,"d":"1.20"}},{"$f":"C8","v":{"v":1.2,"d":"1.20"}},{"$f":"C8","v":{"v":1.2,"d":"1.20"}},{"$f":"C8","v":{"v":1.2,"d":"1.20"}},{"$f":"C8","v":{"v":1.2,"d":"1.20"}},{"$f":"C8","v":{"v":1.2,"d":"1.20"}},{"$f":"C8","v":{"v":1.2,"d":"1.20"}},{"$f":"C8","v":{"v":1.2,"d":"1.20"}},{"$f":"C8","v":{"v":1.2,"d":"1.20"}},{"$f":"C8","v":{"v":1.2,"d":"1.20"}},{"$f":"C8","v":{"v":1.2,"d":"1.20"}},{"$f":"C8","v":{"v":1.2,"d":"1.20"}},{"$f":"C8","v":{"v":1.2,"d":"1.20"}},{"$f":"C8","v":{"v":1.2,"d":"1.20"}},{"$f":"C8","v":{"v":1.2,"d":"1.20"}},{"$f":"C8","v":{"v":1.2,"d":"1.20"}}]
[null,"- szerokość, m",{"v":0.2,"d":"0.20"},{"$f":"C9","v":{"v":0.2,"d":"0.20"}},{"$f":"C9","v":{"v":0.2,"d":"0.20"}},{"$f":"C9","v":{"v":0.2,"d":"0.20"}},{"$f":"C9","v":{"v":0.2,"d":"0.20"}},{"$f":"C9","v":{"v":0.2,"d":"0.20"}},{"$f":"C9","v":{"v":0.2,"d":"0.20"}},{"$f":"C9","v":{"v":0.2,"d":"0.20"}},{"$f":"C9","v":{"v":0.2,"d":"0.20"}},{"$f":"C9","v":{"v":0.2,"d":"0.20"}},{"$f":"C9","v":{"v":0.2,"d":"0.20"}},{"$f":"C9","v":{"v":0.2,"d":"0.20"}},{"$f":"C9","v":{"v":0.2,"d":"0.20"}},{"$f":"C9","v":{"v":0.2,"d":"0.20"}},{"$f":"C9","v":{"v":0.2,"d":"0.20"}},{"$f":"C9","v":{"v":0.2,"d":"0.20"}},{"$f":"C9","v":{"v":0.2,"d":"0.20"}},{"$f":"C9","v":{"v":0.2,"d":"0.20"}},{"$f":"C9","v":{"v":0.2,"d":"0.20"}},{"$f":"C9","v":{"v":0.2,"d":"0.20"}},{"$f":"C9","v":{"v":0.2,"d":"0.20"}}]
[null,"Rząd 1"]
[null,"Liczba łączników na jedną płytę, szt","→",{"$f":"D12+D13","v":{"v":1,"d":"1.00"}},{"$f":"E12+E13","v":{"v":1,"d":"1.00"}},{"v":2,"d":"2.00"},{"v":2,"d":"2.00"},{"v":2,"d":"2.00"},{"v":3,"d":"3.00"},{"$f":"J12+J13","v":{"v":3,"d":"3.00"}},{"$f":"K12+K13","v":{"v":4,"d":"4.00"}},{"$f":"L12+L13","v":{"v":4,"d":"4.00"}},{"$f":"M12+M13","v":{"v":5,"d":"5.00"}},{"$f":"N12+N13","v":{"v":5,"d":"5.00"}},{"$f":"O12+O13","v":{"v":5,"d":"5.00"}},{"$f":"P12+P13","v":{"v":1,"d":"1.00"}},{"$f":"Q12+Q13","v":{"v":2,"d":"2.00"}},{"$f":"R12+R13","v":{"v":2,"d":"2.00"}},{"$f":"S12+S13","v":{"v":2,"d":"2.00"}},{"v":3,"d":"3.00"},{"v":3,"d":"3.00"},{"v":4,"d":"4.00"},{"$f":"W12+W13","v":{"v":5,"d":"5.00"}}]
[null,"Liczba łączników na jedną płytę umieszczonych w polu płyty, szt","→",{"v":0,"d":"0.00"},{"v":0,"d":"0.00"},{"v":1,"d":"1.00"},{"v":1,"d":"1.00"},{"v":1,"d":"1.00"},{"v":2,"d":"2.00"},{"v":2,"d":"2.00"},{"v":3,"d":"3.00"},{"v":3,"d":"3.00"},{"v":4,"d":"4.00"},{"v":4,"d":"4.00"},{"v":4,"d":"4.00"},{"v":1,"d":"1.00"},{"v":2,"d":"2.00"},{"v":2,"d":"2.00"},{"v":2,"d":"2.00"},{"v":3,"d":"3.00"},{"v":3,"d":"3.00"},{"v":4,"d":"4.00"},{"v":2,"d":"2.00"}]
[null,"Liczba łączników na jedną płytę umieszczonych w spoinach, szt","→",{"v":1,"d":"1.00"},{"v":1,"d":"1.00"},{"v":1,"d":"1.00"},{"v":1,"d":"1.00"},{"v":1,"d":"1.00"},{"v":1,"d":"1.00"},{"v":1,"d":"1.00"},{"v":1,"d":"1.00"},{"v":1,"d":"1.00"},{"v":1,"d":"1.00"},{"v":1,"d":"1.00"},{"v":1,"d":"1.00"},{"v":0,"d":"0.00"},{"v":0,"d":"0.00"},{"v":0,"d":"0.00"},{"v":0,"d":"0.00"},{"v":0,"d":"0.00"},{"v":0,"d":"0.00"},{"v":0,"d":"0.00"},{"v":3,"d":"3.00"}]
[null,"Rząd 2"]
[null,"Liczba łączników na jedną płytę, szt","→",{"$f":"D16+D17","v":{"v":1,"d":"1.00"}},{"$f":"E16+E17","v":{"v":1,"d":"1.00"}},{"v":1,"d":"1.00"},{"v":2,"d":"2.00"},{"v":2,"d":"2.00"},{"v":2,"d":"2.00"},{"v":2,"d":"2.00"},{"v":2,"d":"2.00"},{"v":2,"d":"2.00"},{"v":2,"d":"2.00"},{"v":2,"d":"2.00"},{"v":3,"d":"3.00"},{"v":1,"d":"1.00"},{"v":1,"d":"1.00"},{"v":2,"d":"2.00"},{"v":3,"d":"3.00"},{"v":3,"d":"3.00"},{"v":4,"d":"4.00"},{"v":4,"d":"4.00"},{"$f":"W16+W17","v":{"v":5,"d":"5.00"}}]
[null,"Liczba łączników na jedną płytę umieszczonych w polu płyty, szt","→",{"v":0,"d":"0.00"},{"v":0,"d":"0.00"},{"v":0,"d":"0.00"},{"v":1,"d":"1.00"},{"v":1,"d":"1.00"},{"v":1,"d":"1.00"},{"v":1,"d":"1.00"},{"v":1,"d":"1.00"},{"v":1,"d":"1.00"},{"v":1,"d":"1.00"},{"v":1,"d":"1.00"},{"v":2,"d":"2.00"},{"v":1,"d":"1.00"},{"v":1,"d":"1.00"},{"v":2,"d":"2.00"},{"v":3,"d":"3.00"},{"v":3,"d":"3.00"},{"v":4,"d":"4.00"},{"v":4,"d":"4.00"},{"v":2,"d":"2.00"}]
[null,"Liczba łączników na jedną płytę umieszczonych w spoinach, szt","→",{"v":1,"d":"1.00"},{"v":1,"d":"1.00"},{"v":1,"d":"1.00"},{"v":1,"d":"1.00"},{"v":1,"d":"1.00"},{"v":1,"d":"1.00"},{"v":1,"d":"1.00"},{"v":1,"d":"1.00"},{"v":1,"d":"1.00"},{"v":1,"d":"1.00"},{"v":1,"d":"1.00"},{"v":1,"d":"1.00"},{"v":0,"d":"0.00"},{"v":0,"d":"0.00"},{"v":0,"d":"0.00"},{"v":0,"d":"0.00"},{"v":0,"d":"0.00"},{"v":0,"d":"0.00"},{"v":0,"d":"0.00"},{"v":3,"d":"3.00"}]
[null,"Rząd 3"]
[null,"Liczba łączników na jedną płytę, szt","→",{"$f":"D20+D21","v":{"v":1,"d":"1.00"}},{"$f":"E20+E21","v":{"v":2,"d":"2.00"}},{"v":2,"d":"2.00"},{"v":2,"d":"2.00"},{"v":2,"d":"2.00"},{"v":2,"d":"2.00"},{"v":3,"d":"3.00"},{"v":3,"d":"3.00"},{"v":4,"d":"4.00"},{"v":4,"d":"4.00"},{"v":5,"d":"5.00"},{"v":5,"d":"5.00"},{"v":1,"d":"1.00"},{"v":2,"d":"2.00"},{"v":2,"d":"2.00"},{"v":2,"d":"2.00"},{"v":3,"d":"3.00"},{"v":3,"d":"3.00"},{"v":4,"d":"4.00"},{"$f":"W20+W21","v":{"v":5,"d":"5.00"}}]
[null,"Liczba łączników na jedną płytę umieszczonych w polu płyty, szt","→",{"v":0,"d":"0.00"},{"v":1,"d":"1.00"},{"v":1,"d":"1.00"},{"v":1,"d":"1.00"},{"v":1,"d":"1.00"},{"v":1,"d":"1.00"},{"v":2,"d":"2.00"},{"v":2,"d":"2.00"},{"v":3,"d":"3.00"},{"v":3,"d":"3.00"},{"v":4,"d":"4.00"},{"v":4,"d":"4.00"},{"v":1,"d":"1.00"},{"v":2,"d":"2.00"},{"v":2,"d":"2.00"},{"v":2,"d":"2.00"},{"v":3,"d":"3.00"},{"v":3,"d":"3.00"},{"v":4,"d":"4.00"},{"v":2,"d":"2.00"}]
[null,"Liczba łączników na jedną płytę umieszczonych w spoinach, szt","→",{"v":1,"d":"1.00"},{"v":1,"d":"1.00"},{"v":1,"d":"1.00"},{"v":1,"d":"1.00"},{"v":1,"d":"1.00"},{"v":1,"d":"1.00"},{"v":1,"d":"1.00"},{"v":1,"d":"1.00"},{"v":1,"d":"1.00"},{"v":1,"d":"1.00"},{"v":1,"d":"1.00"},{"v":1,"d":"1.00"},{"v":0,"d":"0.00"},{"v":0,"d":"0.00"},{"v":0,"d":"0.00"},{"v":0,"d":"0.00"},{"v":0,"d":"0.00"},{"v":0,"d":"0.00"},{"v":0,"d":"0.00"},{"v":3,"d":"3.00"}]
[null,"Rząd 4"]
[null,"Liczba łączników na jedną płytę, szt","→",{"$f":"D24+D25","v":{"v":1,"d":"1.00"}},{"$f":"E24+E25","v":{"v":1,"d":"1.00"}},{"v":1,"d":"1.00"},{"v":1,"d":"1.00"},{"v":2,"d":"2.00"},{"v":2,"d":"2.00"},{"v":2,"d":"2.00"},{"v":2,"d":"2.00"},{"v":2,"d":"2.00"},{"v":2,"d":"2.00"},{"v":2,"d":"2.00"},{"v":2,"d":"2.00"},{"v":1,"d":"1.00"},{"v":1,"d":"1.00"},{"v":2,"d":"2.00"},{"v":3,"d":"3.00"},{"v":3,"d":"3.00"},{"v":4,"d":"4.00"},{"v":4,"d":"4.00"},{"$f":"W24+W25","v":{"v":5,"d":"5.00"}}]
[null,"Liczba łączników na jedną płytę umieszczonych w polu płyty, szt","→",{"v":0,"d":"0.00"},{"v":0,"d":"0.00"},{"v":0,"d":"0.00"},{"v":0,"d":"0.00"},{"v":1,"d":"1.00"},{"v":1,"d":"1.00"},{"v":1,"d":"1.00"},{"v":1,"d":"1.00"},{"v":1,"d":"1.00"},{"v":1,"d":"1.00"},{"v":1,"d":"1.00"},{"v":1,"d":"1.00"},{"v":1,"d":"1.00"},{"v":1,"d":"1.00"},{"v":2,"d":"2.00"},{"v":3,"d":"3.00"},{"v":3,"d":"3.00"},{"v":4,"d":"4.00"},{"v":4,"d":"4.00"},{"v":2,"d":"2.00"}]
[null,"Liczba łączników na jedną płytę umieszczonych w spoinach, szt","→",{"v":1,"d":"1.00"},{"v":1,"d":"1.00"},{"v":1,"d":"1.00"},{"v":1,"d":"1.00"},{"v":1,"d":"1.00"},{"v":1,"d":"1.00"},{"v":1,"d":"1.00"},{"v":1,"d":"1.00"},{"v":1,"d":"1.00"},{"v":1,"d":"1.00"},{"v":1,"d":"1.00"},{"v":1,"d":"1.00"},{"v":0,"d":"0.00"},{"v":0,"d":"0.00"},{"v":0,"d":"0.00"},{"v":0,"d":"0.00"},{"v":0,"d":"0.00"},{"v":0,"d":"0.00"},{"v":0,"d":"0.00"},{"v":3,"d":"3.00"}]
[]
[null,"Liczba łączników na m², n, szt","→",{"$f":"(D11+D15+D19+D23)/(4*D8*D9)","v":{"v":4.166666666666667,"d":"4.17"}},{"v":5.208333333333334,"d":"5.21"},6.25,{"v":7.291666666666667,"d":"7.29"},{"v":8.333333333333334,"d":"8.33"},{"v":9.375,"d":"9.38"},{"v":10.416666666666668,"d":"10.42"},{"v":11.458333333333334,"d":"11.46"},{"v":12.5,"d":"12.50"},{"v":13.541666666666668,"d":"13.54"},{"v":14.583333333333334,"d":"14.58"},{"v":15.625,"d":"15.63"},{"v":4.166666666666667,"d":"4.17"},6.25,{"v":8.333333333333334,"d":"8.33"},{"v":10.416666666666668,"d":"10.42"},{"v":12.5,"d":"12.50"},{"v":14.583333333333334,"d":"14.58"},{"v":16.666666666666668,"d":"16.67"},{"v":20.833333333333336,"d":"20.83"}]
[null,"Liczba łączników umieszczonych w polu płyt, na (npanel), szt/m²","→",{"$f":"(D12+D16+D20+D24)/(4*D8*D9)","v":{"v":0,"d":"0.00"}},{"$f":"(E12+E16+E20+E24)/(4*E8*E9)","v":{"v":1.0416666666666667,"d":"1.04"}},{"$f":"(F12+F16+F20+F24)/(4*F8*F9)","v":{"v":2.0833333333333335,"d":"2.08"}},{"$f":"(G12+G16+G20+G24)/(4*G8*G9)","v":{"v":3.125,"d":"3.13"}},{"$f":"(H12+H16+H20+H24)/(4*H8*H9)","v":{"v":4.166666666666667,"d":"4.17"}},{"v":5.208333333333334,"d":"5.21"},6.25,{"v":7.291666666666667,"d":"7.29"},{"v":8.333333333333334,"d":"8.33"},{"v":9.375,"d":"9.38"},{"v":10.416666666666668,"d":"10.42"},{"$f":"(O12+O16+O20+O24)/(4*O8*O9)","v":{"v":11.458333333333334,"d":"11.46"}},{"$f":"(P12+P16+P20+P24)/(4*P8*P9)","v":{"v":4.166666666666667,"d":"4.17"}},{"$f":"(Q12+Q16+Q20+Q24)/(4*Q8*Q9)","v":6.25},{"$f":"(R12+R16+R20+R24)/(4*R8*R9)","v":{"v":8.333333333333334,"d":"8.33"}},{"$f":"(S12+S16+S20+S24)/(4*S8*S9)","v":{"v":10.416666666666668,"d":"10.42"}},{"v":12.5,"d":"12.50"},{"v":14.583333333333334,"d":"14.58"},{"v":16.666666666666668,"d":"16.67"},{"v":8.333333333333334,"d":"8.33"}]
[null,"Liczba łączników umieszczonych w spoinach, nj (njoint), szt/m²","→",{"$f":"(D13+D17+D21+D25)/(4*D8*D9)","v":{"v":4.166666666666667,"d":"4.17"}},{"$f":"(E13+E17+E21+E25)/(4*E8*E9)","v":{"v":4.166666666666667,"d":"4.17"}},{"v":4.166666666666667,"d":"4.17"},{"v":4.166666666666667,"d":"4.17"},{"v":4.166666666666667,"d":"4.17"},{"v":4.166666666666667,"d":"4.17"},{"v":4.166666666666667,"d":"4.17"},{"v":4.166666666666667,"d":"4.17"},{"v":4.166666666666667,"d":"4.17"},{"$f":"(M13+M17+M21+M25)/(4*M8*M9)","v":{"v":4.166666666666667,"d":"4.17"}},{"v":4.166666666666667,"d":"4.17"},{"v":4.166666666666667,"d":"4.17"},{"v":0,"d":"0.00"},{"v":0,"d":"0.00"},{"v":0,"d":"0.00"},{"v":0,"d":"0.00"},{"v":0,"d":"0.00"},{"v":0,"d":"0.00"},{"v":0,"d":"0.00"},{"v":12.5,"d":"12.50"}]
[]
[null,"Wyrywanie łączników z podłoża"]
[null,"Nośność charakterystyczna pojedynczego łącznika na wyrywanie z podłoża NR,k, kN",{"v":1.2,"d":"1.20"},{"$f":"C32","v":{"v":1.2,"d":"1.20"}},{"$f":"C32","v":{"v":1.2,"d":"1.20"}},{"$f":"C32","v":{"v":1.2,"d":"1.20"}},{"$f":"C32","v":{"v":1.2,"d":"1.20"}},{"$f":"C32","v":{"v":1.2,"d":"1.20"}},{"$f":"C32","v":{"v":1.2,"d":"1.20"}},{"$f":"C32","v":{"v":1.2,"d":"1.20"}},{"$f":"C32","v":{"v":1.2,"d":"1.20"}},{"$f":"C32","v":{"v":1.2,"d":"1.20"}},{"$f":"C32","v":{"v":1.2,"d":"1.20"}},{"$f":"C32","v":{"v":1.2,"d":"1.20"}},{"$f":"C32","v":{"v":1.2,"d":"1.20"}},{"$f":"C32","v":{"v":1.2,"d":"1.20"}},{"$f":"C32","v":{"v":1.2,"d":"1.20"}},{"$f":"C32","v":{"v":1.2,"d":"1.20"}},{"$f":"C32","v":{"v":1.2,"d":"1.20"}},{"$f":"C32","v":{"v":1.2,"d":"1.20"}},{"$f":"C32","v":{"v":1.2,"d":"1.20"}},{"$f":"C32","v":{"v":1.2,"d":"1.20"}},{"$f":"C32","v":{"v":1.2,"d":"1.20"}}]
[null,"Częściowy współczynnik bezpieczeństwa, -",{"v":2,"d":"2.00"},{"$f":"C33","v":{"v":2,"d":"2.00"}},{"$f":"C33","v":{"v":2,"d":"2.00"}},{"$f":"C33","v":{"v":2,"d":"2.00"}},{"$f":"C33","v":{"v":2,"d":"2.00"}},{"$f":"C33","v":{"v":2,"d":"2.00"}},{"$f":"C33","v":{"v":2,"d":"2.00"}},{"$f":"C33","v":{"v":2,"d":"2.00"}},{"$f":"C33","v":{"v":2,"d":"2.00"}},{"$f":"C33","v":{"v":2,"d":"2.00"}},{"$f":"C33","v":{"v":2,"d":"2.00"}},{"$f":"C33","v":{"v":2,"d":"2.00"}},{"$f":"C33","v":{"v":2,"d":"2.00"}},{"$f":"C33","v":{"v":2,"d":"2.00"}},{"$f":"C33","v":{"v":2,"d":"2.00"}},{"$f":"C33","v":{"v":2,"d":"2.00"}},{"$f":"C33","v":{"v":2,"d":"2.00"}},{"$f":"C33","v":{"v":2,"d":"2.00"}},{"$f":"C33","v":{"v":2,"d":"2.00"}},{"$f":"C33","v":{"v":2,"d":"2.00"}},{"$f":"C33","v":{"v":2,"d":"2.00"}}]
[null,"Nośność obliczeniowa łączników na wyrywanie z podłoża Rd,f, kN/m²","→",{"$f":"((D28+D29)*D32)/D33","v":{"v":2.5,"d":"2.50"}},{"v":3.1250000000000004,"d":"3.13"},3.75,{"v":4.375,"d":"4.38"},{"v":5,"d":"5.00"},{"v":5.625,"d":"5.63"},{"v":6.250000000000001,"d":"6.25"},{"v":6.875,"d":"6.88"},{"v":7.5,"d":"7.50"},{"v":8.125,"d":"8.13"},{"v":8.750000000000002,"d":"8.75"},{"v":9.375,"d":"9.38"},{"v":2.5,"d":"2.50"},3.75,{"v":5,"d":"5.00"},{"v":6.250000000000001,"d":"6.25"},{"v":7.5,"d":"7.50"},8.75,{"v":10,"d":"10.00"},{"v":12.500000000000002,"d":"12.50"}]
[]
[null,"Przeciąganie płyt przez łączniki"]
[null,"Nośność charakterystyczna (siła niszcząca) na przeciąganie przez łącznik umieszczony w polu płyty, Fk,a (Rpanel) albo przy obrzeżach, Fk,ec, kN",0.57,{"$f":"C37","v":0.57},{"$f":"C37","v":0.57},{"$f":"C37","v":0.57},{"$f":"C37","v":0.57},{"$f":"C37","v":0.57},{"$f":"C37","v":0.57},{"$f":"C37","v":0.57},{"$f":"C37","v":0.57},{"$f":"C37","v":0.57},{"$f":"C37","v":0.57},{"$f":"C37","v":0.57},{"$f":"C37","v":0.57},{"$f":"C37","v":0.57},{"$f":"C37","v":0.57},{"$f":"C37","v":0.57},{"$f":"C37","v":0.57},{"$f":"C37","v":0.57},{"$f":"C37","v":0.57},{"$f":"C37","v":0.57},{"$f":"C37","v":0.57}]
[null,"Nośność charakterystyczna (siła niszcząca) na przeciąganie przez łącznik umieszczony w stykach płyt (spoinach), Fk,j (Rjoint), kN",0.57,{"$f":"C38","v":0.57},{"$f":"C38","v":0.57},{"$f":"C38","v":0.57},{"$f":"C38","v":0.57},{"$f":"C38","v":0.57},{"$f":"C38","v":0.57},{"$f":"C38","v":0.57},{"$f":"C38","v":0.57},{"$f":"C38","v":0.57},{"$f":"C38","v":0.57},{"$f":"C38","v":0.57},{"$f":"C38","v":0.57},{"$f":"C38","v":0.57},{"$f":"C38","v":0.57},{"$f":"C38","v":0.57},{"$f":"C38","v":0.57},{"$f":"C38","v":0.57},{"$f":"C38","v":0.57},{"$f":"C38","v":0.57},{"$f":"C38","v":0.57}]
[null,"Częściowy współczynnik bezpieczeństwa, -",{"v":2,"d":"2.00"},{"$f":"C39","v":{"v":2,"d":"2.00"}},{"$f":"C39","v":{"v":2,"d":"2.00"}},{"$f":"C39","v":{"v":2,"d":"2.00"}},{"$f":"C39","v":{"v":2,"d":"2.00"}},{"$f":"C39","v":{"v":2,"d":"2.00"}},{"$f":"C39","v":{"v":2,"d":"2.00"}},{"$f":"C39","v":{"v":2,"d":"2.00"}},{"$f":"C39","v":{"v":2,"d":"2.00"}},{"$f":"C39","v":{"v":2,"d":"2.00"}},{"$f":"C39","v":{"v":2,"d":"2.00"}},{"$f":"C39","v":{"v":2,"d":"2.00"}},{"$f":"C39","v":{"v":2,"d":"2.00"}},{"$f":"C39","v":{"v":2,"d":"2.00"}},{"$f":"C39","v":{"v":2,"d":"2.00"}},{"$f":"C39","v":{"v":2,"d":"2.00"}},{"$f":"C39","v":{"v":2,"d":"2.00"}},{"$f":"C39","v":{"v":2,"d":"2.00"}},{"$f":"C39","v":{"v":2,"d":"2.00"}},{"$f":"C39","v":{"v":2,"d":"2.00"}},{"$f":"C39","v":{"v":2,"d":"2.00"}}]
[null,"Nośność obliczeniowa systemu ETICS na przeciąganie Rd,ETICS, kN/m²","→",{"$f":"(D37*D28+D38*D29)/D39","v":{"v":1.1875,"d":"1.19"}},{"v":1.484375,"d":"1.48"},{"v":1.78125,"d":"1.78"},{"v":2.078125,"d":"2.08"},{"v":2.375,"d":"2.38"},{"v":2.671875,"d":"2.67"},{"v":2.96875,"d":"2.97"},{"$f":"(K37*K28)/K39","v":{"v":2.078125,"d":"2.08"}},{"$f":"(L37*L28+L38*L29)/L39","v":{"v":3.5625,"d":"3.56"}},{"v":3.8593749999999996,"d":"3.86"},{"v":4.15625,"d":"4.16"},{"v":4.453125,"d":"4.45"},{"v":1.1875,"d":"1.19"},{"v":1.7812499999999998,"d":"1.78"},{"v":2.375,"d":"2.38"},{"v":2.96875,"d":"2.97"},{"v":3.5624999999999996,"d":"3.56"},{"v":4.15625,"d":"4.16"},4.75,{"v":5.9375,"d":"5.94"}]
[]
[null,"Łączne uwzględnienie wyrywania i przeciągania"]
[null,"Nośność obliczeniowa miarodajna  Rd, kN/m²",null,{"$f":" D28*MIN(D37/D39,D32/D33)+D29*MIN(D38/D39,D32/D33)","v":{"v":1.1875,"d":"1.19"}},{"v":1.484375,"d":"1.48"},{"v":1.78125,"d":"1.78"},{"v":2.078125,"d":"2.08"},{"v":2.375,"d":"2.38"},{"v":2.671875,"d":"2.67"},{"v":2.96875,"d":"2.97"},{"v":3.265625,"d":"3.27"},{"v":3.5625,"d":"3.56"},{"v":3.8593749999999996,"d":"3.86"},{"v":4.15625,"d":"4.16"},{"v":4.453125,"d":"4.45"},{"v":1.1875,"d":"1.19"},{"v":1.7812499999999998,"d":"1.78"},{"v":2.375,"d":"2.38"},{"v":2.96875,"d":"2.97"},{"v":3.5624999999999996,"d":"3.56"},{"v":4.15625,"d":"4.16"},4.75,{"v":5.9375,"d":"5.94"}]
[]
[]
[]
[null,"Należy spełnić warunki:"]
[null,"Rd   ≥   we,d"]
[]
[null,"δ   ≥   δN"]
[]
[null,"oraz"]
[null,"n   ≥   nmin"]
{"$rows_empty":17}
[null,null,0]
[null,null,0.5]
[null,null,1]
[null,null,1.5]
[null,null,2]
[null,null,2.5]
[null,null,3]
[null,null,3.5]
[null,null,4]
[null,null,4.5]
[null,null,5]
[null,null,5.5]
[null,null,6]
[null,null,6.5]
[null,null,7]
[null,null,7.5]
[null,null,8]
[null,null,8.5]
[null,null,9]
[null,null,9.5]
[null,null,10]

{"sheet":"Obliczenia wiatr I","index":5,"n_rows":127,"n_cols":4,"rows_kept":127,"merged":[[1,1,2,6],[3,1,3,6],[7,3,7,4],[16,2,16,8],[41,1,41,2],[54,1,54,2],[63,1,63,2],[99,2,110,3]]}
[]
[null,"Obliczanie oddziaływania wiatru we,d  według PN EN 1991-1-4:2008"]
[]
[null,"Wiatr I - takie same warunki ze wszystkich kierunków"]
[]
[null,"Wartości strefowe"]
[null,"Strefa obciążenia wiatrem",2]
[null,"Wysokość nad poziomem morza, a [m]",120,"http://www.wysokosc.mapa.info.pl/"]
[null,"Wartość podstawowa bazowej prędkości wiatru, vb,o [m/s]",{"$f":"IF(AND(C7=1,C8<=300),22,IF(AND(C7=1,C8>300),22*(1+0.0006*(C8-300)),IF(C7=2,26,IF(AND(C7=3,C8<=300),22,IF(AND(C7=3,C8>300),22*(1+0.0006*(C8-300)),IF(AND(C7=\"Granica 1 i 2\",C8<=300),24,IF(AND(C7=\"Granica 1 i 2\",C8>300),(22*(1+0.0006*(C8-300))+26)/2,\"-\")))))))","v":{"v":26,"d":"26.00"}}]
[null,"Współczynnik sezonowy, cseason",{"v":1,"d":"1.0"}]
[null,"Współczynnik kierunkowy, cdir",{"v":1,"d":"1.0"}]
[null,"Bazowa prędkość wiatru, vb, [m/s]",{"$f":"C9*C11*C10","v":{"v":26,"d":"26.00"}}]
[null,"Wartość podstawowa ciśnienia prędkości wiatru, qb,o [kN/m²]",{"$f":"IF(AND(C7=1,C8<=300),0.3,IF(AND(C7=1,C8>300),0.3*(1+0.0006*(C8-300))^2,IF(C7=2,0.42,IF(AND(C7=3,C8<=300),0.3,IF(AND(C7=3,C8>300),0.3*((1+0.0006*(C8-300))^2)*((20000-C8)/(20000+C8)),IF(AND(C7=\"Granica 1 i 2\",C8<=300),0.36,IF(AND(C7=\"Granica 1 i 2\",C8>300),((0.3*(1+0.0006*(C8-300))^2)+0.42)/2,\"-\")))))))","v":0.42}]
[]
[null,"Parametry terenu"]
[null,"Kategoria terenu (0, I, II, III albo IV)","III"]
[null,"Charakterystyka terenu",{"$f":"IF(C16=0,\"Morze, obszar brzegowy otwarty na morze\",IF(C16=\"I\",\"Jeziora albo obszary z pomijalną niewielką roślinnością i bez przeszkód\",IF(C16=\"II\",\"Obszary z niską roślinnością, taką jak trawa, oraz pojedynczymi przeszkodami (drzewa, budynki) oddalonymi od siebie na odległość nie mniejszą niż 20 ich wysokości\",IF(C16=\"III\",\"Obszary regularnie pokryte roślinnością albo budynkami lub z pojedynczymi przeszkodami oddalonymi od siebie na odległość nie większą niż 20 ich wysokości (jak wsie, tereny podmiejskie, stałe lasy)\",IF(C16=\"IV\",\"Obszary, na których przynajmniej 15% powierzchni pokrywają budynki o średniej wysokości przekraczającej 15 m\",\"-\")))))","v":"Obszary regularnie pokryte roślinnością albo budynkami lub z pojedynczymi przeszkodami oddalonymi od siebie na odległość nie większą niż 20 ich wysokości (jak wsie, tereny podmiejskie, stałe lasy)"}]
[null,"Wysokość chropowatości, zo [m]",{"$f":"IF(C16=0,0.003,IF(C16=\"I\",0.01,IF(C16=\"II\",0.05,IF(C16=\"III\",0.3,IF(C16=\"IV\",1,\"-\")))))","v":0.3}]
[null,"Wysokość minimalna, zmin [m]",{"$f":"IF(C16=0,1,IF(C16=\"I\",1,IF(C16=\"II\",2,IF(C16=\"III\",5,IF(C16=\"IV\",10,\"-\")))))","v":5}]
[null,"Wysokość maksymalna (wg NA), zmax [m]",{"$f":"IF(C16=0,200,IF(C16=\"I\",200,IF(C16=\"II\",300,IF(C16=\"III\",400,IF(C16=\"IV\",500,\"-\")))))","v":400}]
[null,"Współczynnik terenu, kr",{"$f":"0.19*(C18/0.05)^0.07","v":{"v":0.21538933156341294,"d":"0.215"}}]
[]
[null,"Charakterystyka budynku"]
[null,"Wysokość, h [m]",25,{"$f":"C24","v":25}]
[null,"Szerokość, b [m]",10,{"$f":"C26","v":28}]
[null,"Głębokość, d [m]",28,{"$f":"C25","v":10}]
[]
[null,"Określenie pól A - C na ścianach bocznych"]
[null,"Określenie pól A - C przy oddziaływaniu wiatru z jednego kierunku"]
[null,"Odległość od krawędzi, e [m]",{"$f":"MIN(C25,2*C24)","v":{"v":10,"d":"10.0"}},{"$f":"MIN(D25,2*D24)","v":{"v":28,"d":"28.0"}}]
[null,"Szerokość pola A na ścianie o długości d, m",{"$f":"IF(C30<C26,C30/5,IF(C30>=5*C26,C26,IF(C30>=C26,C30/5,0)))","v":{"v":2,"d":"2.0"}},{"$f":"IF(D30<D26,D30/5,IF(D30>=5*D26,D26,IF(D30>=D26,D30/5,0)))","v":5.6}]
[null,"Szerokość pola B na ścianie o długości d, m",{"$f":"IF(C30<C26,4*C30/5,IF(C30>=5*C26,0,IF(C30>=C26,C26-C30/5,0)))","v":{"v":8,"d":"8.0"}},{"$f":"IF(D30<D26,4*D30/5,IF(D30>=5*D26,0,IF(D30>=D26,D26-D30/5,0)))","v":4.4}]
[null,"Szerokość pola C na ścianie o długości d, m",{"$f":"IF(C30<C26,C26-C30,0)","v":{"v":18,"d":"18.0"}},{"$f":"IF(D30<D26,D26-D30,0)","v":{"v":0,"d":"0.0"}}]
[]
[null,"Określenie pól A - C z uwzględnieniem przeciwnych kierunków wiatru"]
[null,"Układ pól na ścianie o długości d",{"$f":"IF(C31>=C32+C33,\"A\",IF(C31+C32>=C33,\"A-B-A\",\"A-B-C-B-A\"))","v":"A-B-C-B-A"},{"$f":"IF(D31>=D32+D33,\"A\",IF(D31+D32>=D33,\"A-B-A\",\"A-B-C-B-A\"))","v":"A"}]
[null,"Szerokość każdego pola A na ścianach o długości d, m",{"$f":"IF(C36=\"A-B-C-B-A\",C31,IF(C36=\"A-B-A\",C31,IF(C36=\"A\",C26,0)))","v":{"v":2,"d":"2.0"}},{"$f":"IF(D36=\"A-B-C-B-A\",D31,IF(D36=\"A-B-A\",D31,IF(D36=\"A\",D26,0)))","v":{"v":10,"d":"10.0"}}]
[null,"Szerokość każdego pola B naścianach o długości d, m",{"$f":"IF(C36=\"A-B-C-B-A\",C32,IF(C36=\"A-B-A\",C26-2*C31,IF(C36=\"A\",0,0)))","v":{"v":8,"d":"8.0"}},{"$f":"IF(D36=\"A-B-C-B-A\",D32,IF(D36=\"A-B-A\",D26-2*D31,IF(D36=\"A\",0,0)))","v":{"v":0,"d":"0.0"}}]
[null,"Szerokość pola C na ścianach o długości d, m",{"$f":"IF(C36=\"A-B-C-B-A\",C26-2*C37-2*C38,0)","v":{"v":8,"d":"8.0"}},{"$f":"IF(D36=\"A-B-C-B-A\",D26-2*D37-2*D38,0)","v":{"v":0,"d":"0.0"}}]
[null,"Szerokości pól na ścianie o długości d, m",{"$f":"IF(C36=\"A\",C37,IF(C36=\"A-B-A\",TEXT(C37,\"####0,0##\")&\" - \"&TEXT(C38,\"####0,0##\")&\" - \"&TEXT(C37,\"####0,0##\"),TEXT(C37,\"####0,0##\")&\" - \"&TEXT(C38,\"####0,0##\")&\" - \"&TEXT(C39,\"####0,0##\")&\" - \"&TEXT(C38,\"####0,0##\")&\" - \"&TEXT(C37,\"####0,0##\")))","v":"2,0 - 8,0 - 8,0 - 8,0 - 2,0"},{"$f":"IF(D36=\"A\",D37,IF(D36=\"A-B-A\",TEXT(D37,\"####0,0##\")&\" - \"&TEXT(D38,\"####0,0##\")&\" - \"&TEXT(D37,\"####0,0##\"),TEXT(D37,\"####0,0##\")&\" - \"&TEXT(D38,\"####0,0##\")&\" - \"&TEXT(D39,\"####0,0##\")&\" - \"&TEXT(D38,\"####0,0##\")&\" - \"&TEXT(D37,\"####0,0##\")))","v":{"v":10,"d":"10.0"}}]
[]
[null,"Szczytowe ciśnienie prędkości wiatru wg zasadniczej części EN"]
[null,"Proporcja h/b",{"$f":"IF(C24<=C25,\"h ≤ b\",IF(AND(C24>C25,C24<=2*C25),\"b < h ≤ 2b\",IF(C24>2*C25,\"h > 2b\",\"\")))","v":"h > 2b"},{"$f":"IF(D24<=D25,\"h ≤ b\",IF(AND(D24>D25,D24<=2*D25),\"b < h ≤ 2b\",IF(D24>2*D25,\"h > 2b\",\"\")))","v":"h ≤ b"}]
[null,"Wysokość odniesienia, ze [m]","ze = h, wysokość zalecana","ze = h, wysokość zalecana"]
[null,"Współczynnik wysokości, -",{"v":1,"d":"1.0"},{"v":1,"d":"1.0"}]
[null,"Przyjęta wysokość odniesienia, ze [m]",{"$f":"IF(C44=\"ze = h, wysokość zalecana\",C24,IF(C44=\"ze = h - b\",C24-C25,IF(C44=\"ze = b\",C25,IF(C44=\"ze = ?, wpisz tu wysokość\",0,C44))))","v":{"v":25,"d":"25.00"}},{"$f":"IF(D44=\"ze = h, wysokość zalecana\",D24,IF(D44=\"ze = h - b\",D24-D25,IF(D44=\"ze = b\",D25,IF(D44=\"ze = ?, wpisz tu wysokość\",0,D44))))","v":{"v":25,"d":"25.00"}}]
[null,"Efektywna wysokość odniesienia, z [m]",{"$f":"IF(C45*C46>=C19,C45*C46,C19)","v":{"v":25,"d":"25.00"}},{"$f":"IF(D45*D46>=C19,D45*D46,C19)","v":{"v":25,"d":"25.00"}}]
[null,"Współczynnik chropowatości na wysokości odniesienia, cr(z)",{"$f":"IF(C47<=200,C21*LN(C47/C18),C21*LN(200/C18))","v":{"v":0.9526344098482824,"d":"0.953"}},{"$f":"IF(D47<=200,C21*LN(D47/C18),C21*LN(200/C18))","v":{"v":0.9526344098482824,"d":"0.953"}}]
[null,"Współczynnik orografii na wysokości odniesienia, co (z)",{"v":1,"d":"1.00"},{"$f":"C49","v":{"v":1,"d":"1.00"}}]
[null,"Średnia prędkość wiatru na wysokości odniesienia, vm(z) [m/s]",{"$f":"C48*C49*C12","v":{"v":24.768494656055342,"d":"24.77"}},{"$f":"D48*D49*C12","v":{"v":24.768494656055342,"d":"24.77"}}]
[null,"Współczynnik turbulencji, kl",{"v":1,"d":"1.0"},{"$f":"C51","v":{"v":1,"d":"1.0"}}]
[null,"Intensywność turbulencji na wysokości odniesienia, Iv(z)",{"$f":"IF(C47<=200,C51/(C49*LN(C47/C18)),C51/(C49*LN(200/C18)))","v":{"v":0.22609862643709888,"d":"0.226"}},{"$f":"IF(D47<=200,D51/(D49*LN(D47/C18)),D51/(D49*LN(200/C18)))","v":{"v":0.22609862643709888,"d":"0.226"}}]
[null,"Szczytowe ciśnienie prędkości na wysokości odniesienia, qp(z) [kN/m²]",{"$f":"((1+7*C52)*0.5*1.25*C50^2)/1000","v":{"v":0.99026536121662,"d":"0.9903"}},{"$f":"((1+7*D52)*0.5*1.25*D50^2)/1000","v":{"v":0.99026536121662,"d":"0.9903"}}]
[]
[null,"Szczytowe ciśnienie prędkości wiatru wg Załącznika krajowego NA, co ≥ 1"]
[null,"Efektywna wysokość odniesienia, z [m]",{"$f":"IF(C47<C19,C19,IF(C47>C20,C20,C47))","v":{"v":25,"d":"25.00"}},{"$f":"IF(D47<C19,C19,IF(D47>C20,C20,D47))","v":{"v":25,"d":"25.00"}}]
[null,"Współczynnik chropowatości na wysokości odniesienia, cr(z)",{"$f":"IF(C16=0,1.3*(C56/10)^0.11,IF(C16=\"I\",1.2*(C56/10)^0.13,IF(C16=\"II\",1*(C56/10)^0.17,IF(C16=\"III\",0.8*(C56/10)^0.19,IF(C16=\"IV\",0.6*(C56/10)^0.24,\"-\")))))","v":{"v":0.9521351287892025,"d":"0.952"}},{"$f":"IF(C16=0,1.3*(D56/10)^0.11,IF(C16=\"I\",1.2*(D56/10)^0.13,IF(C16=\"II\",1*(D56/10)^0.17,IF(C16=\"III\",0.8*(D56/10)^0.19,IF(C16=\"IV\",0.6*(D56/10)^0.24,\"-\")))))","v":{"v":0.9521351287892025,"d":"0.952"}}]
[null,"Współczynnik orografii na wysokości odniesienia, co (z)",{"$f":"C49","v":{"v":1,"d":"1.00"}},{"$f":"C49","v":{"v":1,"d":"1.00"}}]
[null,"Średnia prędkość wiatru na wysokości odniesienia, vm(z) [m/s]",{"$f":"C57*C58*C12","v":{"v":24.755513348519266,"d":"24.76"}},{"$f":"D57*D58*C12","v":{"v":24.755513348519266,"d":"24.76"}}]
[null,"Współczynnik turbulencji, kl",{"$f":"C51","v":{"v":1,"d":"1.0"}},{"$f":"C51","v":{"v":1,"d":"1.0"}}]
[null,"Intensywność turbulencji na wysokości odniesienia, Iv(z)",{"$f":"C52","v":{"v":0.22609862643709888,"d":"0.226"}},{"$f":"D52","v":{"v":0.22609862643709888,"d":"0.226"}}]
[null,"Szczytowe ciśnienie prędkości na wysokości odniesienia, qp(z) [kN/m²]",{"$f":"((1+7*C61)*0.5*1.25*C59^2)/1000","v":{"v":0.9892276259241264,"d":"0.9892"}},{"$f":"((1+7*D61)*0.5*1.25*D59^2)/1000","v":{"v":0.9892276259241264,"d":"0.9892"}}]
[]
[null,"Szczytowe ciśnienie prędkości wiatru wg Załącznika krajowego NA, co = 1"]
[null,"Współczynnik ekspozycji, ce(z)",{"$f":"IF(C16=0,3*(C47/10)^0.17,IF(C16=\"I\",2.8*(C47/10)^0.19,IF(C16=\"II\",2.3*(C47/10)^0.24,IF(C16=\"III\",1.9*(C47/10)^0.26,IF(C16=\"IV\",1.5*(C47/10)^0.29,\"-\")))))","v":{"v":2.4111154348387354,"d":"2.4111"}},{"$f":"IF(C16=0,3*(D47/10)^0.17,IF(C16=\"I\",2.8*(D47/10)^0.19,IF(C16=\"II\",2.3*(D47/10)^0.24,IF(C16=\"III\",1.9*(D47/10)^0.26,IF(C16=\"IV\",1.5*(D47/10)^0.29,\"-\")))))","v":{"v":2.4111154348387354,"d":"2.4111"}}]
[null,"Wartość bazowa ciśnienia prędkości, qb [kN/m²]",{"$f":"(0.5*1.25*C12^2)/1000","v":0.4225},{"$f":"(0.5*1.25*C12^2)/1000","v":0.4225}]
[null,"Szczytowe ciśnienie prędkości na wysokości odniesienia, qp(z) [kN/m²]",{"$f":"C65*C66","v":{"v":1.0186962712193657,"d":"1.0187"}},{"$f":"D65*D66","v":{"v":1.0186962712193657,"d":"1.0187"}}]
[]
[null,"Przyjmowane do obliczeń szczytowe ciśnienie prędkości wiatru"]
[null,"Szczytowe ciśnienie prędkości wg EN albo NA ?","NA, co = 1"]
[null,"Szczytowe ciśnienie prędkości na wysokości odniesienia, qp(z) [kN/m²]",{"$f":"IF(C70=\"EN\",C53,IF(C70=\"NA, co ≥ 1\",C62,IF(C70=\"NA, co = 1\",C67,\"-\")))","v":{"v":1.0186962712193657,"d":"1.0187"}},{"$f":"IF(C70=\"EN\",D53,IF(C70=\"NA, co ≥ 1\",D62,IF(C70=\"NA, co = 1\",D67,\"-\")))","v":{"v":1.0186962712193657,"d":"1.0187"}}]
[]
[null,"Współczynniki ciśnienia zewnętrznego"]
[null,"Proporcja h/d",{"$f":"C24/C26","v":{"v":0.8928571428571429,"d":"0.89"}},{"$f":"D24/D26","v":{"v":2.5,"d":"2.50"}}]
[null,"Współczynnik ciśnienia zewnętrznego, -"]
[null,"pole A",-1.4,-1.4]
[null,"pole B",-1.1,-1.1]
[null,"pole C",-0.5,-0.5]
[null,"pole E",{"$f":"IF(C74<=0.25,-0.3,IF(AND(C74>0.25,C74<1),-0.23333333333-0.26666666667*C74,IF(AND(C74>=1,C74<=5),-0.45-0.05*C74,-0.7)))","v":{"v":-0.47142857142821426,"d":"-0.47"}},{"$f":"IF(D74<=0.25,-0.3,IF(AND(D74>0.25,D74<1),-0.23333333333-0.26666666667*D74,IF(AND(D74>=1,D74<=5),-0.45-0.05*D74,-0.7)))","v":{"v":-0.575,"d":"-0.58"}}]
[]
[null,"Ciśnienie wiatru na powierzchnie"]
[null,"Wartość charakterystyczna ciśnienia wiatru we [kN/m²]"]
[null,"pole A",{"$f":"C71*C76","v":{"v":-1.4261747797071118,"d":"-1.4262"}},{"$f":"D71*D76","v":{"v":-1.4261747797071118,"d":"-1.4262"}}]
[null,"pole B",{"$f":"IF(C32=0,0,C71*C77)","v":{"v":-1.1205658983413023,"d":"-1.1206"}},{"$f":"IF(D32=0,0,D71*D77)","v":{"v":-1.1205658983413023,"d":"-1.1206"}}]
[null,"pole C",{"$f":"IF(C33=0,0,C71*C78)","v":{"v":-0.5093481356096828,"d":"-0.5093"}},{"$f":"IF(D33=0,0,D71*D78)","v":{"v":0,"d":"0.0000"}}]
[null,"pole E",{"$f":"C71*C79","v":{"v":-0.4802425278601943,"d":"-0.4802"}},{"$f":"D71*D79","v":{"v":-0.5857503559511352,"d":"-0.5858"}}]
[null,"Częściowy współczynnik bezpieczeństwa, γQ, -",1.5,{"$f":"C87","v":1.5}]
[null,"Dodatkowe obciążenie prostopadłe do powierzchni pd [kN/m²]",0,{"$f":"C88","v":0}]
[null,"Wartość obliczeniowa ssania wiatru we,d [kN/m²]"]
[null,"pole A",{"$f":"IF(C83=0,0,(-1*C83*C87)+C88)","v":{"v":2.1392621695606677,"d":"2.14"}},{"$f":"IF(D83=0,0,(-1*D83*D87)+D88)","v":{"v":2.1392621695606677,"d":"2.14"}}]
[null,"pole B",{"$f":"IF(C84=0,0,(-1*C84*C87)+C88)","v":{"v":1.6808488475119534,"d":"1.68"}},{"$f":"IF(D84=0,0,(-1*D84*D87)+D88)","v":{"v":1.6808488475119534,"d":"1.68"}}]
[null,"pole C",{"$f":"IF(C85=0,0,(-1*C85*C87)+C88)","v":{"v":0.7640222034145243,"d":"0.76"}},{"$f":"IF(D85=0,0,(-1*D85*D87)+D88)","v":{"v":0,"d":"0.00"}}]
[null,"pole E",{"$f":"IF(C86=0,0,(-1*C86*C87)+C88)","v":{"v":0.7203637917902914,"d":"0.72"}},{"$f":"IF(D86=0,0,(-1*D86*D87)+D88)","v":{"v":0.8786255339267028,"d":"0.88"}}]
[null,null,{"$f":"IF(AND(D93>C92,C36=\"A-B-C-B-A\"),\"Uwaga! W polu C decyduje obciążenie z pola E\",\" \")","v":"Uwaga! W polu C decyduje obciążenie z pola E"},{"$f":"IF(AND(C93>D92,D36=\"A-B-C-B-A\"),\"Uwaga! W polu C decyduje obciążenie z pola E\",\" \")","v":" "}]
[]
[null,"Układ ciśnienia z uwzględnieniem czterech kierunków wiatru","Ściana II i ściana IV","Ściana I i ściana III"]
[null,"Szerokości pól na ścianie o długości d, m",{"$f":"C40","v":"2,0 - 8,0 - 8,0 - 8,0 - 2,0"},{"$f":"D40","v":{"v":10,"d":"10.0"}}]
[null,"Wartość obl. ssania wiatru w polach ściany o długości d, we,d [kN/m²]",{"$f":"IF(C36=\"A\",C90,IF(C36=\"A-B-A\",TEXT(C90,\"####0,0#\")&\" - \"&TEXT(C91,\"####0,0#\")&\" - \"&TEXT(C90,\"####0,0#\"),TEXT(C90,\"####0,0#\")&\" - \"&TEXT(C91,\"####0,0#\")&\" - \"&IF(C92>=D93,TEXT(C92,\"####0,0#\"),TEXT(D93,\"####0,0#\"))&\" - \"&TEXT(C91,\"####0,0#\")&\" - \"&TEXT(C90,\"####0,0#\")))","v":"2,14 - 1,68 - 0,88 - 1,68 - 2,14"},{"$f":"IF(D36=\"A\",D90,IF(D36=\"A-B-A\",TEXT(D90,\"####0,0#\")&\" - \"&TEXT(D91,\"####0,0#\")&\" - \"&TEXT(D90,\"####0,0#\"),TEXT(D90,\"####0,0#\")&\" - \"&TEXT(D91,\"####0,0#\")&\" - \"&IF(D92>=C93,TEXT(D92,\"####0,0#\"),TEXT(C93,\"####0,0#\"))&\" - \"&TEXT(D91,\"####0,0#\")&\" - \"&TEXT(D90,\"####0,0#\")))","v":{"v":2.1392621695606677,"d":"2.14"}}]
{"$rows_empty":17}
[null,1,null,"ze = h, wysokość zalecana"]
[null,2]
[null,3,null,"ze = h, wysokość zalecana"]
[null,"Granica 1 i 2",null,"ze = b"]
[null,0]
[null,"I",null,"ze = h, wysokość zalecana"]
[null,"II",null,"ze = h - b"]
[null,"III",null,"ze = b"]
[null,"IV",null,"ze = ?, wpisz tu wysokość"]
[null,"EN","równa wysokości budynku"]
[null,"NA, co ≥ 1","inna - wpisz tu wartość"]
[null,"NA, co = 1"]

{"sheet":"Obliczenia wiatr II","index":6,"n_rows":145,"n_cols":7,"rows_kept":145,"merged":[[1,1,2,6],[3,1,3,6],[7,3,7,4],[10,7,20,7],[25,7,33,7],[38,1,38,2],[52,1,52,2],[61,1,61,2],[97,3,97,6],[98,3,98,6],[99,3,99,6],[101,3,129,6],[144,3,145,6]]}
[]
[null,"Obliczanie oddziaływania wiatru we,d  według PN EN 1991-1-4:2008"]
[]
[null,"Wiatr II - różne warunki w zależności od kierunku"]
[]
[null,"Wartości strefowe"]
[null,"Strefa obciążenia wiatrem (1, 2 albo 3)",2]
[null,"Wysokość nad poziomem morza, a [m]",120,"http://www.wysokosc.mapa.info.pl/"]
[null,"Wartość podstawowa bazowej prędkości wiatru, vb,o [m/s]",{"$f":"IF(AND(C7=1,C8<=300),22,IF(AND(C7=1,C8>300),22*(1+0.0006*(C8-300)),IF(C7=2,26,IF(AND(C7=3,C8<=300),22,IF(AND(C7=3,C8>300),22*(1+0.0006*(C8-300)),IF(AND(OR(C7=\"1 przy granicy z 2\",C7=\"2 przy granicy z 1\"),C8<=300),24,IF(AND(OR(C7=\"1 przy granicy z 2\",C7=\"2 przy granicy z 1\"),C8>300),(22*(1+0.0006*(C8-300))+26)/2,\"-\")))))))","v":26}]
[null,"Współczynnik sezonowy, cseason",{"v":1,"d":"1.0"}]
[null,"Kąt odchylenia osi budynku od kierunku północnego, α [°]",10]
[null,"Sytuacje obliczeniowe","→","Wiatr 1","Wiatr 2","Wiatr 3","Wiatr 4"]
[null,"Kierunek wiatru","→",{"$f":"C11","v":10},{"$f":"IF(D13+90>360,D13+90-360,D13+90)","v":100},{"$f":"IF(E13+90>360,E13+90-360,E13+90)","v":190},{"$f":"IF(F13+90>360,F13+90-360,F13+90)","v":280}]
[null,"Współczynnik kierunkowy obliczony wg NA, cdir","→",{"$f":"IF(AND(OR(C7=1,C7=\"1 przy granicy z 2\"),D13>15,D13<195),0.7,IF(AND(OR(C7=1, C7=\"1 przy granicy z 2\"),D13>=195,D13<225),0.8,IF(AND(OR(C7=1, C7=\"1 przy granicy z 2\"),D13>=225,D13<255),0.9,IF(AND(OR(C7=1,C7=\"1 przy granicy z 2\"),D13>=255,D13<=315),1,IF(AND(OR(C7=1,C7=\"1 przy granicy z 2\"),D13>315,D13<=345),0.9,IF(OR(C7=1,C7=\"1 przy granicy z 2\"),0.8,IF(AND(OR(C7=2,C7=\"2 przy granicy z 1\"),D13>15,D13<=45),0.9,IF(AND(OR(C7=2,C7=\"2 przy granicy z 1\"),D13>45,D13<=75),0.8,IF(AND(OR(C7=2,C7=\"2 przy granicy z 1\"),D13>75,D13<195),0.7,IF(AND(OR(C7=2,C7=\"2 przy granicy z 1\"),D13>=195,D13<225),0.8,IF(AND(OR(C7=2,C7=\"2 przy granicy z 1\"),D13>=225,D13<255),0.9,IF(OR(C7=2,C7=\"2 przy granicy z 1\"),1,IF(AND(C7=3,D13>15,D13<135),0.7,IF(AND(C7=3,D13>=135,D13<165),0.9,IF(AND(C7=3,D13>=165,D13<=345),1,IF(C7=3,0.8,0))))))))))))))))","v":{"v":1,"d":"1.0"}},{"$f":"IF(AND(OR(C7=1,C7=\"1 przy granicy z 2\"),E13>15,E13<195),0.7,IF(AND(OR(C7=1, C7=\"1 przy granicy z 2\"),E13>=195,E13<225),0.8,IF(AND(OR(C7=1, C7=\"1 przy granicy z 2\"),E13>=225,E13<255),0.9,IF(AND(OR(C7=1,C7=\"1 przy granicy z 2\"),E13>=255,E13<=315),1,IF(AND(OR(C7=1,C7=\"1 przy granicy z 2\"),E13>315,E13<=345),0.9,IF(OR(C7=1,C7=\"1 przy granicy z 2\"),0.8,IF(AND(OR(C7=2,C7=\"2 przy granicy z 1\"),E13>15,E13<=45),0.9,IF(AND(OR(C7=2,C7=\"2 przy granicy z 1\"),E13>45,E13<=75),0.8,IF(AND(OR(C7=2,C7=\"2 przy granicy z 1\"),E13>75,E13<195),0.7,IF(AND(OR(C7=2,C7=\"2 przy granicy z 1\"),E13>=195,E13<225),0.8,IF(AND(OR(C7=2,C7=\"2 przy granicy z 1\"),E13>=225,E13<255),0.9,IF(OR(C7=2,C7=\"2 przy granicy z 1\"),1,IF(AND(C7=3,E13>15,E13<135),0.7,IF(AND(C7=3,E13>=135,E13<165),0.9,IF(AND(C7=3,E13>=165,E13<=345),1,IF(C7=3,0.8,0))))))))))))))))","v":0.7},{"$f":"IF(AND(OR(C7=1,C7=\"1 przy granicy z 2\"),F13>15,F13<195),0.7,IF(AND(OR(C7=1, C7=\"1 przy granicy z 2\"),F13>=195,F13<225),0.8,IF(AND(OR(C7=1, C7=\"1 przy granicy z 2\"),F13>=225,F13<255),0.9,IF(AND(OR(C7=1,C7=\"1 przy granicy z 2\"),F13>=255,F13<=315),1,IF(AND(OR(C7=1,C7=\"1 przy granicy z 2\"),F13>315,F13<=345),0.9,IF(OR(C7=1,C7=\"1 przy granicy z 2\"),0.8,IF(AND(OR(C7=2,C7=\"2 przy granicy z 1\"),F13>15,F13<=45),0.9,IF(AND(OR(C7=2,C7=\"2 przy granicy z 1\"),F13>45,F13<=75),0.8,IF(AND(OR(C7=2,C7=\"2 przy granicy z 1\"),F13>75,F13<195),0.7,IF(AND(OR(C7=2,C7=\"2 przy granicy z 1\"),F13>=195,F13<225),0.8,IF(AND(OR(C7=2,C7=\"2 przy granicy z 1\"),F13>=225,F13<255),0.9,IF(OR(C7=2,C7=\"2 przy granicy z 1\"),1,IF(AND(C7=3,F13>15,F13<135),0.7,IF(AND(C7=3,F13>=135,F13<165),0.9,IF(AND(C7=3,F13>=165,F13<=345),1,IF(C7=3,0.8,0))))))))))))))))","v":0.7},{"$f":"IF(AND(OR(C7=1,C7=\"1 przy granicy z 2\"),G13>15,G13<195),0.7,IF(AND(OR(C7=1, C7=\"1 przy granicy z 2\"),G13>=195,G13<225),0.8,IF(AND(OR(C7=1, C7=\"1 przy granicy z 2\"),G13>=225,G13<255),0.9,IF(AND(OR(C7=1,C7=\"1 przy granicy z 2\"),G13>=255,G13<=315),1,IF(AND(OR(C7=1,C7=\"1 przy granicy z 2\"),G13>315,G13<=345),0.9,IF(OR(C7=1,C7=\"1 przy granicy z 2\"),0.8,IF(AND(OR(C7=2,C7=\"2 przy granicy z 1\"),G13>15,G13<=45),0.9,IF(AND(OR(C7=2,C7=\"2 przy granicy z 1\"),G13>45,G13<=75),0.8,IF(AND(OR(C7=2,C7=\"2 przy granicy z 1\"),G13>75,G13<195),0.7,IF(AND(OR(C7=2,C7=\"2 przy granicy z 1\"),G13>=195,G13<225),0.8,IF(AND(OR(C7=2,C7=\"2 przy granicy z 1\"),G13>=225,G13<255),0.9,IF(OR(C7=2,C7=\"2 przy granicy z 1\"),1,IF(AND(C7=3,G13>15,G13<135),0.7,IF(AND(C7=3,G13>=135,G13<165),0.9,IF(AND(C7=3,G13>=165,G13<=345),1,IF(C7=3,0.8,0))))))))))))))))","v":{"v":1,"d":"1.0"}}]
[null,"Współczynnik kierunkowy według NA albo EN?","wartość zależna od kierunku",{"$f":"C15","v":"wartość zależna od kierunku"},{"$f":"C15","v":"wartość zależna od kierunku"},{"$f":"C15","v":"wartość zależna od kierunku"},{"$f":"C15","v":"wartość zależna od kierunku"}]
[null,"Współczynnik kierunkowy przyjęty do obliczeń, cdir","→",{"$f":"IF(D15=\"wartość zależna od kierunku\",D14,IF(D15=\"wartość stała maksymalna\",1,\"?\"))","v":{"v":1,"d":"1.0"}},{"$f":"IF(E15=\"wartość zależna od kierunku\",E14,IF(E15=\"wartość stała maksymalna\",1,\"?\"))","v":0.7},0.7,{"v":1,"d":"1.0"}]
[null,"Bazowa prędkość wiatru, vb, [m/s]","→",{"$f":"C9*D16*C10","v":26},{"$f":"C9*E16*C10","v":18.2},{"$f":"C9*F16*C10","v":18.2},{"$f":"C9*G16*C10","v":26}]
[null,"Wartość podstawowa ciśnienia prędkości wiatru, qb,o [kN/m²]",{"$f":"IF(AND(C7=1,C8<=300),0.3,IF(AND(C7=1,C8>300),0.3*(1+0.0006*(C8-300))^2,IF(C7=2,0.42,IF(AND(C7=3,C8<=300),0.3,IF(AND(C7=3,C8>300),0.3*((1+0.0006*(C8-300))^2)*((20000-C8)/(20000+C8)),IF(AND(OR(C7=\"1 przy granicy z 2\",C7=\"2 przy granicy z 1\"),C8<=300),0.36,IF(AND(OR(C7=\"1 przy granicy z 2\",C7=\"2 przy granicy z 1\"),C8>300),((0.3*(1+0.0006*(C8-300))^2)+0.42)/2,\"-\")))))))","v":0.42}]
[]
[null,"Parametry terenu"]
[null,"Kategoria terenu (0, I, II, III albo IV) dla poszczególnych kierunków","→","III","III","III","III"]
[null,"Wysokość chropowatości, zo [m]","→",{"$f":"IF(D21=0,0.003,IF(D21=\"I\",0.01,IF(D21=\"II\",0.05,IF(D21=\"III\",0.3,IF(D21=\"IV\",1,\"-\")))))","v":0.3},{"$f":"IF(E21=0,0.003,IF(E21=\"I\",0.01,IF(E21=\"II\",0.05,IF(E21=\"III\",0.3,IF(E21=\"IV\",1,\"-\")))))","v":0.3},{"$f":"IF(F21=0,0.003,IF(F21=\"I\",0.01,IF(F21=\"II\",0.05,IF(F21=\"III\",0.3,IF(F21=\"IV\",1,\"-\")))))","v":0.3},{"$f":"IF(G21=0,0.003,IF(G21=\"I\",0.01,IF(G21=\"II\",0.05,IF(G21=\"III\",0.3,IF(G21=\"IV\",1,\"-\")))))","v":0.3}]
[null,"Wysokość minimalna, zmin [m]","→",{"$f":"IF(D21=0,1,IF(D21=\"I\",1,IF(D21=\"II\",2,IF(D21=\"III\",5,IF(D21=\"IV\",10,\"-\")))))","v":5},{"$f":"IF(E21=0,1,IF(E21=\"I\",1,IF(E21=\"II\",2,IF(E21=\"III\",5,IF(E21=\"IV\",10,\"-\")))))","v":5},{"$f":"IF(F21=0,1,IF(F21=\"I\",1,IF(F21=\"II\",2,IF(F21=\"III\",5,IF(F21=\"IV\",10,\"-\")))))","v":5},{"$f":"IF(G21=0,1,IF(G21=\"I\",1,IF(G21=\"II\",2,IF(G21=\"III\",5,IF(G21=\"IV\",10,\"-\")))))","v":5}]
[null,"Wysokość maksymalna (wg NA), zmax [m]","→",{"$f":"IF(D21=0,200,IF(D21=\"I\",200,IF(D21=\"II\",300,IF(D21=\"III\",400,IF(D21=\"IV\",500,\"-\")))))","v":400},{"$f":"IF(E21=0,200,IF(E21=\"I\",200,IF(E21=\"II\",300,IF(E21=\"III\",400,IF(E21=\"IV\",500,\"-\")))))","v":400},{"$f":"IF(F21=0,200,IF(F21=\"I\",200,IF(F21=\"II\",300,IF(F21=\"III\",400,IF(F21=\"IV\",500,\"-\")))))","v":400},{"$f":"IF(G21=0,200,IF(G21=\"I\",200,IF(G21=\"II\",300,IF(G21=\"III\",400,IF(G21=\"IV\",500,\"-\")))))","v":400}]
[null,"Współczynnik terenu, kr","→",{"$f":"0.19*(D22/0.05)^0.07","v":{"v":0.21538933156341294,"d":"0.215"}},{"v":0.21538933156341294,"d":"0.215"},{"v":0.21538933156341294,"d":"0.215"},{"v":0.21538933156341294,"d":"0.215"}]
[]
[null,"Charakterystyka budynku",null,"Wiatr 1","Wiatr 2","Wiatr 3","Wiatr 4"]
[null,"Wysokość, h [m]",25,{"$f":"C28","v":25},{"$f":"C28","v":25},{"$f":"C28","v":25},{"$f":"C28","v":25}]
[null,"Szerokość, b [m]",10,{"$f":"C29","v":10},{"$f":"C30","v":28},{"$f":"C29","v":10},{"$f":"C30","v":28}]
[null,"Głębokość, d [m]",28,{"$f":"C30","v":28},{"$f":"C29","v":10},{"$f":"C30","v":28},{"$f":"C29","v":10}]
[]
[null,"Określenie pól A - C na ścianach bocznych"]
[null,"Określenie pól A - C przy oddziaływaniu wiatru z jednego kierunku"]
[null,"Odległość od krawędzi, e [m]","→",{"$f":"MIN(D29,2*D28)","v":{"v":10,"d":"10.0"}},{"$f":"MIN(E29,2*E28)","v":{"v":28,"d":"28.0"}},{"v":10,"d":"10.0"},{"v":28,"d":"28.0"}]
[null,"Szerokość pola A na ścianie o długości d, m","→",{"$f":"IF(D34<D30,D34/5,IF(D34>=5*D30,D30,IF(D34>=D30,D34/5,0)))","v":{"v":2,"d":"2.0"}},{"$f":"IF(E34<E30,E34/5,IF(E34>=5*E30,E30,IF(E34>=E30,E34/5,0)))","v":5.6},{"$f":"IF(F34<F30,F34/5,IF(F34>=5*F30,F30,IF(F34>=F30,F34/5,0)))","v":{"v":2,"d":"2.0"}},{"$f":"IF(G34<G30,G34/5,IF(G34>=5*G30,G30,IF(G34>=G30,G34/5,0)))","v":5.6}]
[null,"Szerokość pola B na ścianie o długości d, m","→",{"$f":"IF(D34<D30,4*D34/5,IF(D34>=5*D30,0,IF(D34>=D30,D30-D34/5,0)))","v":{"v":8,"d":"8.0"}},{"$f":"IF(E34<E30,4*E34/5,IF(E34>=5*E30,0,IF(E34>=E30,E30-E34/5,0)))","v":4.4},{"$f":"IF(F34<F30,4*F34/5,IF(F34>=5*F30,0,IF(F34>=F30,F30-F34/5,0)))","v":{"v":8,"d":"8.0"}},{"$f":"IF(G34<G30,4*G34/5,IF(G34>=5*G30,0,IF(G34>=G30,G30-G34/5,0)))","v":4.4}]
[null,"Szerokość pola C na ścianie o długości d, m","→",{"$f":"IF(D34<D30,D30-D34,0)","v":{"v":18,"d":"18.0"}},{"$f":"IF(E34<E30,E30-E34,0)","v":{"v":0,"d":"0.0"}},{"$f":"IF(F34<F30,F30-F34,0)","v":{"v":18,"d":"18.0"}},{"$f":"IF(G34<G30,G30-G34,0)","v":{"v":0,"d":"0.0"}}]
[]
[null,"Szczytowe ciśnienie prędkości wiatru wg zasadniczej części EN"]
[null,"Proporcja h/b","→",{"$f":"IF(D28<=D29,\"h ≤ b\",IF(AND(D28>D29,D28<=2*D29),\"b < h ≤ 2b\",IF(D28>2*D29,\"h > 2b\",\"\")))","v":"h > 2b"},{"$f":"IF(E28<=E29,\"h ≤ b\",IF(AND(E28>E29,E28<=2*E29),\"b < h ≤ 2b\",IF(E28>2*E29,\"h > 2b\",\"\")))","v":"h ≤ b"},{"$f":"IF(F28<=F29,\"h ≤ b\",IF(AND(F28>F29,F28<=2*F29),\"b < h ≤ 2b\",IF(F28>2*F29,\"h > 2b\",\"\")))","v":"h > 2b"},{"$f":"IF(G28<=G29,\"h ≤ b\",IF(AND(G28>G29,G28<=2*G29),\"b < h ≤ 2b\",IF(G28>2*G29,\"h > 2b\",\"\")))","v":"h ≤ b"}]
[null,"Wysokość odniesienia, ze [m]","→","ze = h, wysokość zalecana","ze = h, wysokość zalecana",{"$f":"D41","v":"ze = h, wysokość zalecana"},{"$f":"E41","v":"ze = h, wysokość zalecana"}]
[null,"Przyjęta wysokość odniesienia, ze [m]","→",{"$f":"IF(D41=\"ze = h, wysokość zalecana\",D28,IF(D41=\"ze = h - b\",D28-D29,IF(D41=\"ze = b\",D29,IF(D41=\"ze = ?, wpisz tu wysokość\",0,D41))))","v":{"v":25,"d":"25.00"}},{"$f":"IF(E41=\"ze = h, wysokość zalecana\",E28,IF(E41=\"ze = h - b\",E28-E29,IF(E41=\"ze = b\",E29,IF(E41=\"ze = ?, wpisz tu wysokość\",0,E41))))","v":{"v":25,"d":"25.00"}},{"$f":"IF(F41=\"ze = h, wysokość zalecana\",F28,IF(F41=\"ze = h - b\",F28-F29,IF(F41=\"ze = b\",F29,IF(F41=\"ze = ?, wpisz tu wysokość\",0,F41))))","v":{"v":25,"d":"25.00"}},{"$f":"IF(G41=\"ze = h, wysokość zalecana\",G28,IF(G41=\"ze = h - b\",G28-G29,IF(G41=\"ze = b\",G29,IF(G41=\"ze = ?, wpisz tu wysokość\",0,G41))))","v":{"v":25,"d":"25.00"}}]
[null,"Współczynnik wysokości, -","→",{"v":1,"d":"1.0"},{"$f":"D43","v":{"v":1,"d":"1.0"}},{"$f":"D43","v":{"v":1,"d":"1.0"}},{"$f":"D43","v":{"v":1,"d":"1.0"}}]
[null,"Wysokość przemieszczenia, hdis [m]","→",{"v":0,"d":"0.0"},{"v":0,"d":"0.0"},{"v":0,"d":"0.0"},{"v":0,"d":"0.0"}]
[null,"Efektywna wysokość odniesienia, z [m]","→",{"$f":"IF(D42*D43-D44>=D23,D42*D43-D44,D23)","v":{"v":25,"d":"25.00"}},{"$f":"IF(E42*E43-E44>=E23,E42*E43-E44,E23)","v":{"v":25,"d":"25.00"}},{"$f":"IF(F42*F43-F44>=F23,F42*F43-F44,F23)","v":{"v":25,"d":"25.00"}},{"$f":"IF(G42*G43-G44>=G23,G42*G43-G44,G23)","v":{"v":25,"d":"25.00"}}]
[null,"Współczynnik chropowatości na wysokości odniesienia, cr(z)","→",{"$f":"IF(D45<=200,D25*LN(D45/D22),D25*LN(200/D22))","v":{"v":0.9526344098482824,"d":"0.953"}},{"$f":"IF(E45<=200,E25*LN(E45/E22),E25*LN(200/E22))","v":{"v":0.9526344098482824,"d":"0.953"}},{"$f":"IF(F45<=200,F25*LN(F45/F22),F25*LN(200/F22))","v":{"v":0.9526344098482824,"d":"0.953"}},{"$f":"IF(G45<=200,G25*LN(G45/G22),G25*LN(200/G22))","v":{"v":0.9526344098482824,"d":"0.953"}}]
[null,"Współczynnik orografii na wysokości odniesienia, co (z)","→",{"v":1,"d":"1.0"},{"v":1,"d":"1.0"},{"v":1,"d":"1.0"},{"v":1,"d":"1.0"}]
[null,"Średnia prędkość wiatru na wysokości odniesienia, vm(z) [m/s]","→",{"$f":"D46*D47*D17","v":{"v":24.768494656055342,"d":"24.77"}},{"$f":"E46*E47*E17","v":{"v":17.337946259238738,"d":"17.34"}},{"$f":"F46*F47*F17","v":{"v":17.337946259238738,"d":"17.34"}},{"$f":"G46*G47*G17","v":{"v":24.768494656055342,"d":"24.77"}}]
[null,"Współczynnik turbulencji, kl","→",{"v":1,"d":"1.0"},{"v":1,"d":"1.0"},{"v":1,"d":"1.0"},{"v":1,"d":"1.0"}]
[null,"Intensywność turbulencji na wysokości odniesienia, Iv(z)","→",{"$f":"IF(D45<=200,D49/(D47*LN(D45/D22)),D49/(D47*LN(200/D22)))","v":{"v":0.22609862643709888,"d":"0.226"}},{"$f":"IF(E45<=200,E49/(E47*LN(E45/E22)),E49/(E47*LN(200/E22)))","v":{"v":0.22609862643709888,"d":"0.226"}},{"$f":"IF(F45<=200,F49/(F47*LN(F45/F22)),F49/(F47*LN(200/F22)))","v":{"v":0.22609862643709888,"d":"0.226"}},{"$f":"IF(G45<=200,G49/(G47*LN(G45/G22)),G49/(G47*LN(200/G22)))","v":{"v":0.22609862643709888,"d":"0.226"}}]
[null,"Szczytowe ciśnienie prędkości na wysokości odniesienia, qp(z) [kN/m²]","→",{"$f":"((1+7*D50)*0.5*1.25*D48^2)/1000","v":{"v":0.99026536121662,"d":"0.9903"}},{"v":0.4852300269961437,"d":"0.4852"},{"v":0.4852300269961437,"d":"0.4852"},{"v":0.99026536121662,"d":"0.9903"}]
[]
[null,"Szczytowe ciśnienie prędkości wiatru wg Załącznika krajowego NA, co ≥ 1"]
[null,"Efektywna wysokość odniesienia, z [m]","→",{"$f":"IF(D42*D43-D44<D23,D23,IF(D42*D43-D44>D24,D24,D42*D43-D44))","v":{"v":25,"d":"25.00"}},{"$f":"IF(E42*E43-E44<E23,E23,IF(E42*E43-E44>E24,E24,E42*E43-E44))","v":{"v":25,"d":"25.00"}},{"$f":"IF(F42*F43-F44<F23,F23,IF(F42*F43-F44>F24,F24,F42*F43-F44))","v":{"v":25,"d":"25.00"}},{"$f":"IF(G42*G43-G44<G23,G23,IF(G42*G43-G44>G24,G24,G42*G43-G44))","v":{"v":25,"d":"25.00"}}]
[null,"Współczynnik chropowatości na wysokości odniesienia, cr(z)","→",{"$f":"IF(D21=0,1.3*(D54/10)^0.11,IF(D21=\"I\",1.2*(D54/10)^0.13,IF(D21=\"II\",1*(D54/10)^0.17,IF(D21=\"III\",0.8*(D54/10)^0.19,IF(D21=\"IV\",0.6*(D54/10)^0.24,\"-\")))))","v":{"v":0.9521351287892025,"d":"0.952"}},{"$f":"IF(E21=0,1.3*(E54/10)^0.11,IF(E21=\"I\",1.2*(E54/10)^0.13,IF(E21=\"II\",1*(E54/10)^0.17,IF(E21=\"III\",0.8*(E54/10)^0.19,IF(E21=\"IV\",0.6*(E54/10)^0.24,\"-\")))))","v":{"v":0.9521351287892025,"d":"0.952"}},{"$f":"IF(F21=0,1.3*(F54/10)^0.11,IF(F21=\"I\",1.2*(F54/10)^0.13,IF(F21=\"II\",1*(F54/10)^0.17,IF(F21=\"III\",0.8*(F54/10)^0.19,IF(F21=\"IV\",0.6*(F54/10)^0.24,\"-\")))))","v":{"v":0.9521351287892025,"d":"0.952"}},{"$f":"IF(G21=0,1.3*(G54/10)^0.11,IF(G21=\"I\",1.2*(G54/10)^0.13,IF(G21=\"II\",1*(G54/10)^0.17,IF(G21=\"III\",0.8*(G54/10)^0.19,IF(G21=\"IV\",0.6*(G54/10)^0.24,\"-\")))))","v":{"v":0.9521351287892025,"d":"0.952"}}]
[null,"Współczynnik orografii na wysokości odniesienia, co (z)","→",{"$f":"D47","v":{"v":1,"d":"1.00"}},{"v":1,"d":"1.00"},{"v":1,"d":"1.00"},{"v":1,"d":"1.00"}]
[null,"Średnia prędkość wiatru na wysokości odniesienia, vm(z) [m/s]","→",{"$f":"D55*D56*D17","v":{"v":24.755513348519266,"d":"24.76"}},{"$f":"E55*E56*E17","v":{"v":17.328859343963483,"d":"17.33"}},{"$f":"F55*F56*F17","v":{"v":17.328859343963483,"d":"17.33"}},{"$f":"G55*G56*G17","v":{"v":24.755513348519266,"d":"24.76"}}]
[null,"Współczynnik turbulencji, kl","→",{"$f":"D49","v":{"v":1,"d":"1.00"}},{"v":1,"d":"1.00"},{"v":1,"d":"1.00"},{"v":1,"d":"1.00"}]
[null,"Intensywność turbulencji na wysokości odniesienia, Iv(z)","→",{"$f":"D50","v":{"v":0.22609862643709888,"d":"0.226"}},{"v":0.22609862643709888,"d":"0.226"},{"v":0.22609862643709888,"d":"0.226"},{"v":0.22609862643709888,"d":"0.226"}]
[null,"Szczytowe ciśnienie prędkości na wysokości odniesienia, qp(z) [kN/m²]","→",{"$f":"((1+7*D59)*0.5*1.25*D57^2)/1000","v":{"v":0.9892276259241264,"d":"0.9892"}},{"v":0.4847215367028218,"d":"0.4847"},{"v":0.4847215367028218,"d":"0.4847"},{"v":0.9892276259241264,"d":"0.9892"}]
[]
[null,"Szczytowe ciśnienie prędkości wiatru wg Załącznika krajowego NA, co = 1"]
[null,"Współczynnik ekspozycji, ce(z)","→",{"$f":"IF(D21=0,3*(D45/10)^0.17,IF(D21=\"I\",2.8*(D45/10)^0.19,IF(D21=\"II\",2.3*(D45/10)^0.24,IF(D21=\"III\",1.9*(D45/10)^0.26,IF(D21=\"IV\",1.5*(D45/10)^0.29,\"-\")))))","v":{"v":2.4111154348387354,"d":"2.4111"}},{"$f":"IF(E21=0,3*(E45/10)^0.17,IF(E21=\"I\",2.8*(E45/10)^0.19,IF(E21=\"II\",2.3*(E45/10)^0.24,IF(E21=\"III\",1.9*(E45/10)^0.26,IF(E21=\"IV\",1.5*(E45/10)^0.29,\"-\")))))","v":{"v":2.4111154348387354,"d":"2.4111"}},{"$f":"IF(F21=0,3*(F45/10)^0.17,IF(F21=\"I\",2.8*(F45/10)^0.19,IF(F21=\"II\",2.3*(F45/10)^0.24,IF(F21=\"III\",1.9*(F45/10)^0.26,IF(F21=\"IV\",1.5*(F45/10)^0.29,\"-\")))))","v":{"v":2.4111154348387354,"d":"2.4111"}},{"$f":"IF(G21=0,3*(G45/10)^0.17,IF(G21=\"I\",2.8*(G45/10)^0.19,IF(G21=\"II\",2.3*(G45/10)^0.24,IF(G21=\"III\",1.9*(G45/10)^0.26,IF(G21=\"IV\",1.5*(G45/10)^0.29,\"-\")))))","v":{"v":2.4111154348387354,"d":"2.4111"}}]
[null,"Wartość bazowa ciśnienia prędkości, qb [kN/m2]","→",{"$f":"(0.5*1.25*D17^2)/1000","v":0.4225},{"$f":"(0.5*1.25*E17^2)/1000","v":{"v":0.207025,"d":"0.2070"}},{"$f":"(0.5*1.25*F17^2)/1000","v":{"v":0.207025,"d":"0.2070"}},{"$f":"(0.5*1.25*G17^2)/1000","v":0.4225}]
[null,"Szczytowe ciśnienie prędkości na wysokości odniesienia, qp(z) [kN/m²]","→",{"$f":"D63*D64","v":{"v":1.0186962712193657,"d":"1.0187"}},{"v":0.4991611728974892,"d":"0.4992"},{"v":0.4991611728974892,"d":"0.4992"},{"v":1.0186962712193657,"d":"1.0187"}]
[]
[null,"Przyjmowane do obliczeń szczytowe ciśnienie prędkości wiatru"]
[null,"Szczytowe ciśnienie prędkości wg EN albo NA ?","NA, co = 1"]
[null,"Szczytowe ciśnienie prędkości na wysokości odniesienia, qp(z) [kN/m²]","→",{"$f":"IF(C68=\"EN\",D51,IF(C68=\"NA, co ≥ 1\",D60,IF(C68=\"NA, co = 1\",D65,\"-\")))","v":{"v":1.0186962712193657,"d":"1.0187"}},{"$f":"IF(C68=\"EN\",E51,IF(C68=\"NA, co ≥ 1\",E60,IF(C68=\"NA, co = 1\",E65,\"-\")))","v":{"v":0.4991611728974892,"d":"0.4992"}},{"$f":"IF(C68=\"EN\",F51,IF(C68=\"NA, co ≥ 1\",F60,IF(C68=\"NA, co = 1\",F65,\"-\")))","v":{"v":0.4991611728974892,"d":"0.4992"}},{"$f":"IF(C68=\"EN\",G51,IF(C68=\"NA, co ≥ 1\",G60,IF(C68=\"NA, co = 1\",G65,\"-\")))","v":{"v":1.0186962712193657,"d":"1.0187"}}]
[]
[null,"Współczynniki ciśnienia zewnętrznego"]
[null,"Proporcja h/d","→",{"$f":"D28/D30","v":{"v":0.8928571428571429,"d":"0.89"}},{"$f":"E28/E30","v":{"v":2.5,"d":"2.50"}},{"$f":"F28/F30","v":{"v":0.8928571428571429,"d":"0.89"}},{"$f":"G28/G30","v":{"v":2.5,"d":"2.50"}}]
[null,"Wartości współczynnika ciśnienia zewnętrznego, -"]
[null,"pole A","→","wartość podstawowa","wartość podstawowa","wartość podstawowa","wartość podstawowa"]
[null,"pole B","→","wartość podstawowa","wartość podstawowa","wartość podstawowa","wartość podstawowa"]
[null,"pole C","→","wartość podstawowa","wartość podstawowa","wartość podstawowa","wartość podstawowa"]
[null,"pole E","→","wartość podstawowa","wartość podstawowa","wartość podstawowa","wartość podstawowa"]
[null,"Przyjęte wartości współczynnika ciśnienia zewnętrznego, -"]
[null,"pole A","→",{"$f":"IF(D74=\"wartość podstawowa\",-1.4,IF(D74=\"wartość maks przy zwężce\",-1.6,IF(D74=\"inna, wpisz tu wartość\",0,D74)))","v":-1.4},{"$f":"IF(E74=\"wartość podstawowa\",-1.4,IF(E74=\"wartość maks przy zwężce\",-1.6,IF(E74=\"inna, wpisz tu wartość\",0,E74)))","v":-1.4},{"$f":"IF(F74=\"wartość podstawowa\",-1.4,IF(F74=\"wartość maks przy zwężce\",-1.6,IF(F74=\"inna, wpisz tu wartość\",0,F74)))","v":-1.4},{"$f":"IF(G74=\"wartość podstawowa\",-1.4,IF(G74=\"wartość maks przy zwężce\",-1.6,IF(G74=\"inna, wpisz tu wartość\",0,G74)))","v":-1.4}]
[null,"pole B","→",{"$f":"IF(D75=\"wartość podstawowa\",-1.1,IF(D75=\"wartość maks przy zwężce\",-1.1,IF(D75=\"inna, wpisz tu wartość\",0,D75)))","v":-1.1},{"$f":"IF(E75=\"wartość podstawowa\",-1.1,IF(E75=\"wartość maks przy zwężce\",-1.1,IF(E75=\"inna, wpisz tu wartość\",0,E75)))","v":-1.1},{"$f":"IF(F75=\"wartość podstawowa\",-1.1,IF(F75=\"wartość maks przy zwężce\",-1.1,IF(F75=\"inna, wpisz tu wartość\",0,F75)))","v":-1.1},{"$f":"IF(G75=\"wartość podstawowa\",-1.1,IF(G75=\"wartość maks przy zwężce\",-1.1,IF(G75=\"inna, wpisz tu wartość\",0,G75)))","v":-1.1}]
[null,"pole C","→",{"$f":"IF(D76=\"wartość podstawowa\",-0.5,IF(D76=\"wartość maks przy zwężce\",-0.9,IF(D76=\"inna, wpisz tu wartość\",0,D76)))","v":-0.5},{"$f":"IF(E76=\"wartość podstawowa\",-0.5,IF(E76=\"wartość maks przy zwężce\",-0.9,IF(E76=\"inna, wpisz tu wartość\",0,E76)))","v":-0.5},{"$f":"IF(F76=\"wartość podstawowa\",-0.5,IF(F76=\"wartość maks przy zwężce\",-0.9,IF(F76=\"inna, wpisz tu wartość\",0,F76)))","v":-0.5},{"$f":"IF(G76=\"wartość podstawowa\",-0.5,IF(G76=\"wartość maks przy zwężce\",-0.9,IF(G76=\"inna, wpisz tu wartość\",0,G76)))","v":-0.5}]
[null,"pole E","→",{"$f":"IF(D77=\"wartość podstawowa\",IF(D72<=0.25,-0.3,IF(AND(D72>0.25,D72<1),-0.23333333333-0.26666666667*D72,IF(AND(D72>=1,D72<=5),-0.45-0.05*D72,-0.7))),IF(D77=\"inna, wpisz tu wartość\",0,D77))","v":{"v":-0.47142857142821426,"d":"-0.47"}},{"$f":"IF(E77=\"wartość podstawowa\",IF(E72<=0.25,-0.3,IF(AND(E72>0.25,E72<1),-0.23333333333-0.26666666667*E72,IF(AND(E72>=1,E72<=5),-0.45-0.05*E72,-0.7))),IF(E77=\"inna, wpisz tu wartość\",0,E77))","v":{"v":-0.575,"d":"-0.58"}},{"$f":"IF(F77=\"wartość podstawowa\",IF(F72<=0.25,-0.3,IF(AND(F72>0.25,F72<1),-0.23333333333-0.26666666667*F72,IF(AND(F72>=1,F72<=5),-0.45-0.05*F72,-0.7))),IF(F77=\"inna, wpisz tu wartość\",0,F77))","v":{"v":-0.47142857142821426,"d":"-0.47"}},{"$f":"IF(G77=\"wartość podstawowa\",IF(G72<=0.25,-0.3,IF(AND(G72>0.25,G72<1),-0.23333333333-0.26666666667*G72,IF(AND(G72>=1,G72<=5),-0.45-0.05*G72,-0.7))),IF(G77=\"inna, wpisz tu wartość\",0,G77))","v":{"v":-0.575,"d":"-0.58"}}]
[]
[null,"Ciśnienie wiatru na powierzchnie"]
[null,"Wartość charakterystyczna ciśnienia wiatru we [kN/m²]"]
[null,"pole A","→",{"$f":"D69*D79","v":{"v":-1.4261747797071118,"d":"-1.4262"}},{"v":-0.6988256420564848,"d":"-0.6988"},{"v":-0.6988256420564848,"d":"-0.6988"},{"v":-1.4261747797071118,"d":"-1.4262"}]
[null,"pole B","→",{"$f":"IF(D36=0,0,D69*D80)","v":{"v":-1.1205658983413023,"d":"-1.1206"}},{"$f":"IF(E36=0,0,E69*E80)","v":{"v":-0.5490772901872382,"d":"-0.5491"}},{"$f":"IF(F36=0,0,F69*F80)","v":{"v":-0.5490772901872382,"d":"-0.5491"}},{"$f":"IF(G36=0,0,G69*G80)","v":{"v":-1.1205658983413023,"d":"-1.1206"}}]
[null,"pole C","→",{"$f":"IF(D37=0,0,D69*D81)","v":{"v":-0.5093481356096828,"d":"-0.5093"}},{"$f":"IF(E37=0,0,E69*E81)","v":{"v":0,"d":"0.0000"}},{"$f":"IF(F37=0,0,F69*F81)","v":{"v":-0.2495805864487446,"d":"-0.2496"}},{"$f":"IF(G37=0,0,G69*G81)","v":{"v":0,"d":"0.0000"}}]
[null,"pole E","→",{"$f":"D69*D82","v":{"v":-0.4802425278601943,"d":"-0.4802"}},{"v":-0.28701767441605625,"d":"-0.2870"},{"v":-0.2353188386514952,"d":"-0.2353"},{"v":-0.5857503559511352,"d":"-0.5858"}]
[null,"Częściowy współczynnik bezpieczeństwa, γQ, -",1.5,{"$f":"C90","v":1.5},{"$f":"C90","v":1.5},{"$f":"C90","v":1.5},{"$f":"C90","v":1.5}]
[null,"Dodatkowe obciążenie prostopadłe do powierzchni pd [kN/m²]",0,{"$f":"C91","v":0},{"$f":"C91","v":0},{"$f":"C91","v":0},{"$f":"C91","v":0}]
[null,"Wartość obliczeniowa ssania wiatru we,d [kN/m²]",null,"Wiatr 1","Wiatr 2","Wiatr 3","Wiatr 4"]
[null,"pole A","→",{"$f":"IF(D86=0,0,(-1*D86*D90)+D91)","v":{"v":2.1392621695606677,"d":"2.14"}},{"$f":"IF(E86=0,0,(-1*E86*E90)+E91)","v":{"v":1.0482384630847272,"d":"1.05"}},{"$f":"IF(F86=0,0,(-1*F86*F90)+F91)","v":{"v":1.0482384630847272,"d":"1.05"}},{"$f":"IF(G86=0,0,(-1*G86*G90)+G91)","v":{"v":2.1392621695606677,"d":"2.14"}}]
[null,"pole B","→",{"$f":"IF(D87=0,0,(-1*D87*D90)+D91)","v":{"v":1.6808488475119534,"d":"1.68"}},{"$f":"IF(E87=0,0,(-1*E87*E90)+E91)","v":{"v":0.8236159352808572,"d":"0.82"}},{"$f":"IF(F87=0,0,(-1*F87*F90)+F91)","v":{"v":0.8236159352808572,"d":"0.82"}},{"$f":"IF(G87=0,0,(-1*G87*G90)+G91)","v":{"v":1.6808488475119534,"d":"1.68"}}]
[null,"pole C","→",{"$f":"IF(D88=0,0,(-1*D88*D90)+D91)","v":{"v":0.7640222034145243,"d":"0.76"}},{"$f":"IF(E88=0,0,(-1*E88*E90)+E91)","v":{"v":0,"d":"0.00"}},{"$f":"IF(F88=0,0,(-1*F88*F90)+F91)","v":{"v":0.3743708796731169,"d":"0.37"}},{"$f":"IF(G88=0,0,(-1*G88*G90)+G91)","v":{"v":0,"d":"0.00"}}]
[null,"pole E","→",{"$f":"IF(D89=0,0,(-1*D89*D90)+D91)","v":{"v":0.7203637917902914,"d":"0.72"}},{"$f":"IF(E89=0,0,(-1*E89*E90)+E91)","v":{"v":0.4305265116240844,"d":"0.43"}},{"$f":"IF(F89=0,0,(-1*F89*F90)+F91)","v":{"v":0.3529782579772428,"d":"0.35"}},{"$f":"IF(G89=0,0,(-1*G89*G90)+G91)","v":{"v":0.8786255339267028,"d":"0.88"}}]
[]
[null,"Układ ciśnienia z uwzględnieniem czterech kierunków wiatru",null,"Należy wybrać wartości maksymalne w poszczególnych polach każdej ściany, z uwzględnieniem kierunków wiatru:"]
[{"$nulls":3},"ściana I - wiatr 2, wiatr 3 i wiatr 4,    ściana II - wiatr 1, wiatr 3 i wiatr 4, "]
[{"$nulls":3},"ściana III - wiatr 1, wiatr2 i wiatr 4,    ściana IV - wiatr 1, wiatr 2 i wiatr 3"]
{"$rows_empty":30}
[null,1]
[null,"1 przy granicy z 2"]
[null,2]
[null,"2 przy granicy z 1",null,"ze = h, wysokość zalecana"]
[null,3]
[null,0,null,"ze = h, wysokość zalecana","wartość podstawowa"]
[null,"I",null,"ze = b","inna, wpisz tu wartość"]
[null,"II","wartość zależna od kierunku"]
[null,"III","wartość stała maksymalna","ze = h, wysokość zalecana","wartość podstawowa"]
[null,"IV",null,"ze = h - b","wartość maks przy zwężce"]
[null,"EN","równa wysokości budynku","ze = b","inna, wpisz tu wartość"]
[null,"NA, co ≥ 1","inna - wpisz tu wartość","ze = ?, wpisz tu wysokość"]
[null,"NA, co = 1"]
[]
[{"$nulls":3},"Uwaga! Na każdej ścianie, przy jednym kierunku wiatru mogą występować trzy pola (A, B, C), dwa pola (A, B) albo jedno pole (A). Określenie pól, zgodnie z normą PN EN 1991-1-4:2008, podano w zakładce \"Pola ścian\"."]

{"sheet":"Wyniki graficzne wiatr I","index":7,"n_rows":104,"n_cols":21,"rows_kept":104,"merged":[[1,1,2,21],[3,1,3,21],[5,1,5,21],[7,9,9,13],[10,8,13,8],[10,9,13,9],[10,10,13,10],[10,11,13,11],[10,12,13,12],[10,13,13,13],[14,8,17,8],[14,9,18,9],[14,10,18,10],[14,11,18,11],[14,12,18,12],[14,13,18,13],[18,7,18,8],[18,14,18,15],[19,4,38,4],[19,5,38,5],[19,6,22,6],[19,7,22,8],[19,14,22,15],[19,16,22,16],[19,17,38,17],[20,9,21,9],[23,6,26,6],[23,7,26,8],[23,14,26,15],[23,16,26,16],[24,9,25,9],[27,6,30,6],[27,7,30,8],[27,14,30,15],[27,16,30,16],[28,9,29,9],[28,13,29,13],[31,6,34,6],[31,7,34,8],[31,14,34,15],[31,16,34,16],[32,9,33,9],[35,6,38,6],[35,7,38,8],[35,14,38,15],[35,16,38,16],[36,9,37,9],[39,8,43,8],[39,9,43,9],[39,10,43,10],[39,11,43,11],[39,12,43,12],[39,13,43,13],[44,8,47,8],[44,9,47,9],[44,10,47,10],[44,11,47,11],[44,12,47,12],[44,13,47,13],[48,9,50,13],[51,9,53,13],[56,9,56,13],[65,9,65,13],[73,2,73,20],[75,2,75,5],[75,7,75,10],[75,12,75,15],[75,17,75,20],[77,3,77,4],[77,8,77,9],[77,13,77,14],[77,18,77,19],[78,3,78,4],[78,8,78,9],[78,13,78,14],[78,18,78,19],[79,3,79,4],[79,8,79,9],[79,13,79,14],[79,18,79,19],[80,3,80,4],[80,8,80,9],[80,13,80,14],[80,18,80,19],[81,3,81,4],[81,8,81,9],[81,13,81,14],[81,18,81,19],[82,3,82,4],[82,8,82,9],[82,13,82,14],[82,18,82,19],[83,3,83,4],[83,8,83,9],[83,13,83,14],[83,18,83,19],[84,3,84,4],[84,8,84,9],[84,13,84,14],[84,18,84,19],[85,3,85,4],[85,8,85,9],[85,13,85,14],[85,18,85,19],[86,3,86,4],[86,8,86,9],[86,13,86,14],[86,18,86,19],[87,3,87,4],[87,8,87,9],[87,13,87,14],[87,18,87,19],[88,3,88,4],[88,8,88,9],[88,13,88,14],[88,18,88,19],[89,3,89,4],[89,8,89,9],[89,13,89,14],[89,18,89,19],[90,3,90,4],[90,8,90,9],[90,13,90,14],[90,18,90,19],[91,3,91,4],[91,8,91,9],[91,13,91,14],[91,18,91,19],[92,3,92,4],[92,8,92,9],[92,13,92,14],[92,18,92,19],[93,3,93,4],[93,8,93,9],[93,13,93,14],[93,18,93,19],[94,3,94,4],[94,8,94,9],[94,13,94,14],[94,18,94,19],[95,3,95,4],[95,8,95,9],[95,13,95,14],[95,18,95,19],[96,3,96,4],[96,8,96,9],[96,13,96,14],[96,18,96,19],[97,3,97,4],[97,8,97,9],[97,13,97,14],[97,18,97,19],[98,3,98,4],[98,8,98,9],[98,13,98,14],[98,18,98,19],[99,3,99,4],[99,8,99,9],[99,13,99,14],[99,18,99,19],[101,2,101,4],[101,7,101,9],[101,12,101,14],[101,17,101,19],[103,2,104,20]]}
[]
[null,"Graficzne przedstawienie wyników obliczeń oddziaływania wiatru"]
[]
[null,"Wiatr I - takie same warunki ze wszystkich kierunków"]
[]
[null,"UWAGA! Wymiary rzutu budynku i szerokości pól ściany nie są pokazywane w skali."]
[]
[{"$nulls":9},{"$f":"\"Wysokość  ze = \"&TEXT('Obliczenia wiatr I'!D46,\"####0,0##\")&\" m\"","v":"Wysokość  ze = 25,0 m"}]
[]
[]
[{"$nulls":8},"m",{"$f":"IF(K102=1,\"\",IF(K102=2,L60,IF(K102=3,\"\",IF(AND(K102=4,L69=N69,L60>=L61),\"\",IF(AND(K102=4,L69<>N69,L60=L61),L61,IF(AND(K102=4,L60>L61,L69>N69),L61,IF(AND(K102=4,L60>L61,L69<N69),L60,IF(K102=5,\"\",IF(K102=6,\"\",IF(K102=7,L60,IF(K102=8,L60,IF(K102=9,\"\",IF(AND(K102=10,L62=0),L60,IF(AND(K102=10,L62>0,L62<L60,L70>=N69,L71<=N69),L62,IF(AND(K102=10,L62>0,L62<L60,L70<N69),L60,IF(AND(K102=10,L62>0,L62=L60),L60,IF(K102=11,L60,IF(K102=12,\"\",IF(K102=13,L60,IF(K102=14,L60,IF(K102=15,L60,IF(K102=16,L60,IF(K102=17,L60,IF(K102=18,L60,IF(K102=19,L60,IF(K102=20,L60,IF(K102=21,L60,IF(K102=22,L60,IF(K102=23,L60,\"\")))))))))))))))))))))))))))))","v":""},{"$f":"IF(K102=1,\"\",IF(K102=2,\"\",IF(K102=3,\"\",IF(K102=4,\"\",IF(K102=5,\"\",IF(K102=6,\"\",IF(K102=7,\"\",IF(K102=8,\"\",IF(K102=9,\"\",IF(K102=10,\"\",IF(AND(K102=11,L62=0),L61-L60,IF(AND(K102=11,L62>0,L62<L60,N70>=L69,N71<=L69),L61,IF(AND(K102=11,L62>0,L62<L60,N70<L69),L61+L62-L60,IF(AND(K102=11,L62>0,L62=L60),L61,IF(K102=12,\"\",IF(K102=13,\"\",IF(K102=14,L61,IF(K102=15,L61,IF(K102=16,\"\",IF(AND(K102=17,L70>N70),L62-L60,IF(AND(K102=17,N70>L70),L61,IF(AND(K102=17,N70=L70),L61+L62-L60,IF(K102=18,L61,IF(K102=19,\"\",IF(K102=20,L61,IF(K102=21,L61,IF(K102=22,L61,IF(K102=23,L61,\"\"))))))))))))))))))))))))))))","v":""},{"$f":"IF(K102=1,\"\",IF(K102=2,\"\",IF(K102=3,\"\",IF(K102=4,\"\",IF(K102=5,L61,IF(K102=6,L61+L62,IF(K102=7,L61,IF(K102=8,L61+L62,IF(K102=9,L62,IF(K102=10,\"\",IF(K102=11,\"\",IF(K102=12,L62,IF(K102=13,\"\",IF(K102=14,L62,IF(K102=15,L62,IF(K102=16,L62-L60,IF(K102=17,\"\",IF(K102=18,L62-L60,IF(K102=19,L62-L60,IF(K102=20,L62-L60,IF(K102=21,L62-(L60+L61),IF(K102=22,L62-(L60+L61),IF(K102=23,L62-(L60+L61),\"\")))))))))))))))))))))))","v":""},{"$f":"IF(K102=1,\"\",IF(K102=2,\"\",IF(K102=3,\"\",IF(K102=4,\"\",IF(K102=5,\"\",IF(K102=6,\"\",IF(K102=7,\"\",IF(K102=8,\"\",IF(K102=9,L61,IF(AND(K102=10,L62=0),L61-L60,IF(AND(K102=10,L62>0,L62<L60,L70>=N69,L71<=N69),L61,IF(AND(K102=10,L62>0,L62<L60,L70<N69),L61+L62-L60,IF(AND(K102=10,L62>0,L62=L60),L61,IF(K102=11,\"\",IF(K102=12,L61,IF(K102=13,L61+L62-L60,IF(K102=14,\"\",IF(K102=15,\"\",IF(K102=16,L61,IF(AND(K102=17,L70>N70),L61,IF(AND(K102=17,N70>L70),L62-L60,IF(AND(K102=17,N70=L70),\"\",IF(K102=18,\"\",IF(K102=19,L61,IF(K102=20,\"\",IF(K102=21,L61,IF(K102=22,L61,IF(K102=23,L61,\"\"))))))))))))))))))))))))))))","v":""},{"$f":"IF(K102=1,L60,IF(K102=2,\"\",IF(K102=3,L60+L61+L62,IF(AND(K102=4,L69=N69,L60>=L61),L60+L61,IF(AND(K102=4,L69<>N69,L60=L61),L60,IF(AND(K102=4,L60>L61,L69>N69),L60,IF(AND(K102=4,L60>L61,L69<N69),L61,IF(K102=5,L60,IF(K102=6,L60,IF(K102=7,\"\",IF(K102=8,\"\",IF(K102=9,L60,IF(K102=10,L60,IF(AND(K102=11,L62=0),L60,IF(AND(K102=11,L62>0,L62<L60,N70>=L69,N71<=L69),L62,IF(AND(K102=11,L62>0,L62<L60,N70<L69),L60,IF(AND(K102=11,L62>0,L62=L60),L60,IF(K102=12,L60,IF(K102=13,L60,IF(K102=14,\"\",IF(K102=15,\"\",IF(K102=16,L60,IF(K102=17,L60,IF(K102=18,L60,IF(K102=19,L60,IF(K102=20,L60,IF(K102=21,L60,IF(K102=22,L60,IF(K102=23,L60,\"\")))))))))))))))))))))))))))))","v":{"v":10,"d":"10.0"}}]
[]
[]
[]
[{"$nulls":8},"kN/m2",{"$f":"IF(OR(K102=2,K102=4,K102=7,K102=8,K102=10,K102=11,K102=13,K102=14,K102=15,K102=16,K102=17,K102=18,K102=19,K102=20,K102=21,K102=22,K102=23),N69,IF(K102=1,L69,IF(OR(K102=3,K102=6,K102=12),M72,IF(K102=5,L70,IF(K102=9,L71,\"\")))))","v":{"v":2.1392621695606677,"d":"2.1393"}},{"$f":"IF(OR(K102=11,K102=14,K102=15,K102=17,K102=18,K102=20,K102=21,K102=22,K102=23),N70,IF(K102=1,L69,IF(OR(K102=2,K102=4,K102=7,K102=8),N69,IF(OR(K102=3,K102=6,K102=12,K102=13,K102=19),M72,IF(OR(K102=5,K102=10),L70,IF(OR(K102=9,K102=16),L71,\"\"))))))","v":{"v":2.1392621695606677,"d":"2.1393"}},{"$f":"IF(K102=1,L69,IF(AND(K102=4,L69>=N69),L69,IF(K102=2,N69,IF(AND(K102=4,N69>L69),N69,IF(OR(K102=3,K102=6,K102=8,K102=12,K102=13,K102=15,K102=19,K102=20,K102=23),M72,IF(OR(K102=5,K102=10),L70,IF(AND(K102=17,L70>N70),L70,IF(AND(K102=17,N70>=L70),N70,IF(OR(K102=7,K102=11),N70,IF(OR(K102=9,K102=16,K102=21),L71,IF(OR(K102=14,K102=18,K102=22),N71,\"\")))))))))))","v":{"v":2.1392621695606677,"d":"2.1393"}},{"$f":"IF(OR(K102=9,K102=10,K102=12,K102=16,K102=17,K102=19,K102=21,K102=22,K102=23),L70,IF(K102=2,N69,IF(OR(K102=3,K102=8,K102=13,K102=15,K102=20),M72,IF(OR(K102=1,K102=4,K102=5,K102=6),L69,IF(OR(K102=7,K102=11),N70,IF(OR(K102=14,K102=18),N71,\"\"))))))","v":{"v":2.1392621695606677,"d":"2.1393"}},{"$f":"IF(OR(K102=1,K102=4,K102=5,K102=6,K102=9,K102=10,K102=11,K102=12,K102=13,K102=16,K102=17,K102=18,K102=19,K102=20,K102=21,K102=22,K102=23),L69,IF(K102=2,N69,IF(OR(K102=3,K102=8,K102=15),M72,IF(K102=7,N70,IF(K102=14,N71,\"\")))))","v":{"v":2.1392621695606677,"d":"2.1393"}}]
[]
[]
[]
[{"$nulls":6},"m","kN/m2",{"$nulls":6},"kN/m2",null,"m"]
[{"$nulls":4},{"$f":"\"Wysokość  ze = \"&TEXT('Obliczenia wiatr I'!C46,\"####0,0##\")&\" m\"","v":"Wysokość  ze = 25,0 m"},{"$f":"TEXT(K60+K61+K62,\"####0,0##\")&\" m\"","v":"28,0 m"},{"$f":"IF(F102=1,K60,IF(F102=2,\"\",IF(F102=3,K60+K61+K62,IF(AND(F102=4,K69=M69,K60>=K61),K60+K61,IF(AND(F102=4,K69<>M69,K60=K61),K60,IF(AND(F102=4,K60>K61,K69>M69),K60,IF(AND(F102=4,K60>K61,K69<M69),K61,IF(F102=5,K60,IF(F102=6,K60,IF(F102=7,\"\",IF(F102=8,\"\",IF(F102=9,K60,IF(F102=10,K60,IF(AND(F102=11,K62=0),K60,IF(AND(F102=11,K62>0,K62<K60,M70>=K69,M71<=K69),K62,IF(AND(F102=11,K62>0,K62<K60,M70<K69),K60,IF(AND(F102=11,K62>0,K62=K60),K60,IF(F102=12,K60,IF(F102=13,K60,IF(F102=14,\"\",IF(F102=15,\"\",IF(F102=16,K60,IF(F102=17,K60,IF(F102=18,K60,IF(F102=19,K60,IF(F102=20,K60,IF(F102=21,K60,IF(F102=22,K60,IF(F102=23,K60,\"\")))))))))))))))))))))))))))))","v":{"v":2,"d":"2.0"}},{"$f":"IF(OR(F102=1,F102=4,F102=5,F102=6,F102=9,F102=10,F102=11,F102=12,F102=13,F102=16,F102=17,F102=18,F102=19,F102=20,F102=21,F102=22,F102=23),K69,IF(F102=2,M69,IF(OR(F102=3,F102=8,F102=15),L72,IF(F102=7,M70,IF(F102=14,M71,\"\")))))","v":{"v":2.1392621695606677,"d":"2.1393"}},{"$nulls":3},"Ściana I",null,null,{"$f":"IF(OR(P102=1,P102=4,P102=5,P102=6,P102=9,P102=10,P102=11,P102=12,P102=13,P102=16,P102=17,P102=18,P102=19,P102=20,P102=21,P102=22,P102=23),K69,IF(P102=2,M69,IF(OR(P102=3,P102=8,P102=15),N72,IF(P102=7,M70,IF(P102=14,M71,\"\")))))","v":{"v":2.1392621695606677,"d":"2.1393"}},null,{"$f":"IF(P102=1,K60,IF(P102=2,\"\",IF(P102=3,K60+K61+K62,IF(AND(P102=4,K69=M69,K60>=K61),K60+K61,IF(AND(P102=4,K69<>M69,K60=K61),K60,IF(AND(P102=4,K60>K61,K69>M69),K60,IF(AND(P102=4,K60>K61,K69<M69),K61,IF(P102=5,K60,IF(P102=6,K60,IF(P102=7,\"\",IF(P102=8,\"\",IF(P102=9,K60,IF(P102=10,K60,IF(AND(P102=11,K62=0),K60,IF(AND(P102=11,K62>0,K62<K60,M70>=K69,M71<=K69),K62,IF(AND(P102=11,K62>0,K62<K60,M70<K69),K60,IF(AND(P102=11,K62>0,K62=K60),K60,IF(P102=12,K60,IF(P102=13,K60,IF(P102=14,\"\",IF(P102=15,\"\",IF(P102=16,K60,IF(P102=17,K60,IF(P102=18,K60,IF(P102=19,K60,IF(P102=20,K60,IF(P102=21,K60,IF(P102=22,K60,IF(P102=23,K60,\"\")))))))))))))))))))))))))))))","v":{"v":2,"d":"2.0"}},{"$f":"\"Wysokość  ze = \"&TEXT('Obliczenia wiatr I'!C46,\"####0,0##\")&\" m\"","v":"Wysokość  ze = 25,0 m"}]
[]
[]
[]
[{"$nulls":6},{"$f":"IF(F102=1,\"\",IF(F102=2,\"\",IF(F102=3,\"\",IF(F102=4,\"\",IF(F102=5,\"\",IF(F102=6,\"\",IF(F102=7,\"\",IF(F102=8,\"\",IF(F102=9,K61,IF(AND(F102=10,K62=0),K61-K60,IF(AND(F102=10,K62>0,K62<K60,K70>=M69,K71<=M69),K61,IF(AND(F102=10,K62>0,K62<K60,K70<M69),K61+K62-K60,IF(AND(F102=10,K62>0,K62=K60),K61,IF(F102=11,\"\",IF(F102=12,K61,IF(F102=13,K61+K62-K60,IF(F102=14,\"\",IF(F102=15,\"\",IF(F102=16,K61,IF(AND(F102=17,K70>M70),K61,IF(AND(F102=17,M70>K70),K62-K60,IF(AND(F102=17,M70=K70),\"\",IF(F102=18,\"\",IF(F102=19,K61,IF(F102=20,\"\",IF(F102=21,K61,IF(F102=22,K61,IF(F102=23,K61,\"\"))))))))))))))))))))))))))))","v":{"v":8,"d":"8.0"}},{"$f":"IF(OR(F102=9,F102=10,F102=12,F102=16,F102=17,F102=19,F102=21,F102=22,F102=23),K70,IF(F102=2,M69,IF(OR(F102=3,F102=8,F102=13,F102=15,F102=20),L72,IF(OR(F102=1,F102=4,F102=5,F102=6),K69,IF(OR(F102=7,F102=11),M70,IF(OR(F102=14,F102=18),M71,\"\"))))))","v":{"v":1.6808488475119534,"d":"1.6808"}},{"$nulls":6},{"$f":"IF(OR(P102=9,P102=10,P102=12,P102=16,P102=17,P102=19,P102=21,P102=22,P102=23),K70,IF(P102=2,M69,IF(OR(P102=3,P102=8,P102=13,P102=15,P102=20),N72,IF(OR(P102=1,P102=4,P102=5,P102=6),K69,IF(OR(P102=7,P102=11),M70,IF(OR(P102=14,P102=18),M71,\"\"))))))","v":{"v":1.6808488475119534,"d":"1.6808"}},null,{"$f":"IF(P102=1,\"\",IF(P102=2,\"\",IF(P102=3,\"\",IF(P102=4,\"\",IF(P102=5,\"\",IF(P102=6,\"\",IF(P102=7,\"\",IF(P102=8,\"\",IF(P102=9,K61,IF(AND(P102=10,K62=0),K61-K60,IF(AND(P102=10,K62>0,K62<K60,K70>=M69,K71<=M69),K61,IF(AND(P102=10,K62>0,K62<K60,K70<M69),K61+K62-K60,IF(AND(P102=10,K62>0,K62=K60),K61,IF(P102=11,\"\",IF(P102=12,K61,IF(P102=13,K61+K62-K60,IF(P102=14,\"\",IF(P102=15,\"\",IF(P102=16,K61,IF(AND(P102=17,K70>M70),K61,IF(AND(P102=17,M70>K70),K62-K60,IF(AND(P102=17,M70=K70),\"\",IF(P102=18,\"\",IF(P102=19,K61,IF(P102=20,\"\",IF(P102=21,K61,IF(P102=22,K61,IF(P102=23,K61,\"\"))))))))))))))))))))))))))))","v":{"v":8,"d":"8.0"}}]
[]
[]
[]
[{"$nulls":6},{"$f":"IF(F102=1,\"\",IF(F102=2,\"\",IF(F102=3,\"\",IF(F102=4,\"\",IF(F102=5,K61,IF(F102=6,K61+K62,IF(F102=7,K61,IF(F102=8,K61+K62,IF(F102=9,K62,IF(F102=10,\"\",IF(F102=11,\"\",IF(F102=12,K62,IF(F102=13,\"\",IF(F102=14,K62,IF(F102=15,K62,IF(F102=16,K62-K60,IF(F102=17,\"\",IF(F102=18,K62-K60,IF(F102=19,K62-K60,IF(F102=20,K62-K60,IF(F102=21,K62-(K60+K61),IF(F102=22,K62-(K60+K61),IF(F102=23,K62-(K60+K61),\"\")))))))))))))))))))))))","v":{"v":8,"d":"8.0"}},{"$f":"IF(F102=1,K69,IF(AND(F102=4,K69>=M69),K69,IF(F102=2,M69,IF(AND(F102=4,M69>K69),M69,IF(OR(F102=3,F102=6,F102=8,F102=12,F102=13,F102=15,F102=19,F102=20,F102=23),L72,IF(OR(F102=5,F102=10),K70,IF(AND(F102=17,K70>M70),K70,IF(AND(F102=17,M70>=K70),M70,IF(OR(F102=7,F102=11),M70,IF(OR(F102=9,F102=16,F102=21),K71,IF(OR(F102=14,F102=18,F102=22),M71,\"\")))))))))))","v":{"v":0.8786255339267028,"d":"0.8786"}},{"$nulls":6},{"$f":"IF(P102=1,K69,IF(AND(P102=4,K69>=M69),K69,IF(P102=2,M69,IF(AND(P102=4,M69>K69),M69,IF(OR(P102=3,P102=6,P102=8,P102=12,P102=13,P102=15,P102=19,P102=20,P102=23),N72,IF(OR(P102=5,P102=10),K70,IF(AND(P102=17,K70>M70),K70,IF(AND(P102=17,M70>=K70),M70,IF(OR(P102=7,P102=11),M70,IF(OR(P102=9,P102=16,P102=21),K71,IF(OR(P102=14,P102=18,P102=22),M71,\"\")))))))))))","v":{"v":0.8786255339267028,"d":"0.8786"}},null,{"$f":"IF(P102=1,\"\",IF(P102=2,\"\",IF(P102=3,\"\",IF(P102=4,\"\",IF(P102=5,K61,IF(P102=6,K61+K62,IF(P102=7,K61,IF(P102=8,K61+K62,IF(P102=9,K62,IF(P102=10,\"\",IF(P102=11,\"\",IF(P102=12,K62,IF(P102=13,\"\",IF(P102=14,K62,IF(P102=15,K62,IF(P102=16,K62-K60,IF(P102=17,\"\",IF(P102=18,K62-K60,IF(P102=19,K62-K60,IF(P102=20,K62-K60,IF(P102=21,K62-(K60+K61),IF(P102=22,K62-(K60+K61),IF(P102=23,K62-(K60+K61),\"\")))))))))))))))))))))))","v":{"v":8,"d":"8.0"}}]
[{"$nulls":9},"Ściana IV",{"$nulls":3},"Ściana II"]
[]
[]
[{"$nulls":6},{"$f":"IF(F102=1,\"\",IF(F102=2,\"\",IF(F102=3,\"\",IF(F102=4,\"\",IF(F102=5,\"\",IF(F102=6,\"\",IF(F102=7,\"\",IF(F102=8,\"\",IF(F102=9,\"\",IF(F102=10,\"\",IF(AND(F102=11,K62=0),K61-K60,IF(AND(F102=11,K62>0,K62<K60,M70>=K69,M71<=K69),K61,IF(AND(F102=11,K62>0,K62<K60,M70<K69),K61+K62-K60,IF(AND(F102=11,K62>0,K62=K60),K61,IF(F102=12,\"\",IF(F102=13,\"\",IF(F102=14,K61,IF(F102=15,K61,IF(F102=16,\"\",IF(AND(F102=17,K70>M70),K62-K60,IF(AND(F102=17,M70>K70),K61,IF(AND(F102=17,M70=K70),K61+K62-K60,IF(F102=18,K61,IF(F102=19,\"\",IF(F102=20,K61,IF(F102=21,K61,IF(F102=22,K61,IF(F102=23,K61,\"\"))))))))))))))))))))))))))))","v":{"v":8,"d":"8.0"}},{"$f":"IF(OR(F102=11,F102=14,F102=15,F102=17,F102=18,F102=20,F102=21,F102=22,F102=23),M70,IF(F102=1,K69,IF(OR(F102=2,F102=4,F102=7,F102=8),M69,IF(OR(F102=3,F102=6,F102=12,F102=13,F102=19),L72,IF(OR(F102=5,F102=10),K70,IF(OR(F102=9,F102=16),K71,\"\"))))))","v":{"v":1.6808488475119534,"d":"1.6808"}},{"$nulls":6},{"$f":"IF(OR(P102=11,P102=14,P102=15,P102=17,P102=18,P102=20,P102=21,P102=22,P102=23),M70,IF(P102=1,K69,IF(OR(P102=2,P102=4,P102=7,P102=8),M69,IF(OR(P102=3,P102=6,P102=12,P102=13,P102=19),N72,IF(OR(P102=5,P102=10),K70,IF(OR(P102=9,P102=16),K71,\"\"))))))","v":{"v":1.6808488475119534,"d":"1.6808"}},null,{"$f":"IF(P102=1,\"\",IF(P102=2,\"\",IF(P102=3,\"\",IF(P102=4,\"\",IF(P102=5,\"\",IF(P102=6,\"\",IF(P102=7,\"\",IF(P102=8,\"\",IF(P102=9,\"\",IF(P102=10,\"\",IF(AND(P102=11,K62=0),K61-K60,IF(AND(P102=11,K62>0,K62<K60,M70>=K69,M71<=K69),K61,IF(AND(P102=11,K62>0,K62<K60,M70<K69),K61+K62-K60,IF(AND(P102=11,K62>0,K62=K60),K61,IF(P102=12,\"\",IF(P102=13,\"\",IF(P102=14,K61,IF(P102=15,K61,IF(P102=16,\"\",IF(AND(P102=17,K70>M70),K62-K60,IF(AND(P102=17,M70>K70),K61,IF(AND(P102=17,M70=K70),K61+K62-K60,IF(P102=18,K61,IF(P102=19,\"\",IF(P102=20,K61,IF(P102=21,K61,IF(P102=22,K61,IF(P102=23,K61,\"\"))))))))))))))))))))))))))))","v":{"v":8,"d":"8.0"}}]
[]
[]
[]
[{"$nulls":6},{"$f":"IF(F102=1,\"\",IF(F102=2,K60,IF(F102=3,\"\",IF(AND(F102=4,K69=M69,K60>=K61),\"\",IF(AND(F102=4,K69<>M69,K60=K61),K61,IF(AND(F102=4,K60>K61,K69>M69),K61,IF(AND(F102=4,K60>K61,K69<M69),K60,IF(F102=5,\"\",IF(F102=6,\"\",IF(F102=7,K60,IF(F102=8,K60,IF(F102=9,\"\",IF(AND(F102=10,K62=0),K60,IF(AND(F102=10,K62>0,K62<K60,K70>=M69,K71<=M69),K62,IF(AND(F102=10,K62>0,K62<K60,K70<M69),K60,IF(AND(F102=10,K62>0,K62=K60),K60,IF(F102=11,K60,IF(F102=12,\"\",IF(F102=13,K60,IF(F102=14,K60,IF(F102=15,K60,IF(F102=16,K60,IF(F102=17,K60,IF(F102=18,K60,IF(F102=19,K60,IF(F102=20,K60,IF(F102=21,K60,IF(F102=22,K60,IF(F102=23,K60,\"\")))))))))))))))))))))))))))))","v":{"v":2,"d":"2.0"}},{"$f":"IF(OR(F102=2,F102=4,F102=7,F102=8,F102=10,F102=11,F102=13,F102=14,F102=15,F102=16,F102=17,F102=18,F102=19,F102=20,F102=21,F102=22,F102=23),M69,IF(F102=1,K69,IF(OR(F102=3,F102=6,F102=12),L72,IF(F102=5,K70,IF(F102=9,K71,\"\")))))","v":{"v":2.1392621695606677,"d":"2.1393"}},{"$nulls":6},{"$f":"IF(OR(P102=2,P102=4,P102=7,P102=8,P102=10,P102=11,P102=13,P102=14,P102=15,P102=16,P102=17,P102=18,P102=19,P102=20,P102=21,P102=22,P102=23),M69,IF(P102=1,K69,IF(OR(P102=3,P102=6,P102=12),N72,IF(P102=5,K70,IF(P102=9,K71,\"\")))))","v":{"v":2.1392621695606677,"d":"2.1393"}},null,{"$f":"IF(P102=1,\"\",IF(P102=2,K60,IF(P102=3,\"\",IF(AND(P102=4,K69=M69,K60>=K61),\"\",IF(AND(P102=4,K69<>M69,K60=K61),K61,IF(AND(P102=4,K60>K61,K69>M69),K61,IF(AND(P102=4,K60>K61,K69<M69),K60,IF(P102=5,\"\",IF(P102=6,\"\",IF(P102=7,K60,IF(P102=8,K60,IF(P102=9,\"\",IF(AND(P102=10,K62=0),K60,IF(AND(P102=10,K62>0,K62<K60,K70>=M69,K71<=M69),K62,IF(AND(P102=10,K62>0,K62<K60,K70<M69),K60,IF(AND(P102=10,K62>0,K62=K60),K60,IF(P102=11,K60,IF(P102=12,\"\",IF(P102=13,K60,IF(P102=14,K60,IF(P102=15,K60,IF(P102=16,K60,IF(P102=17,K60,IF(P102=18,K60,IF(P102=19,K60,IF(P102=20,K60,IF(P102=21,K60,IF(P102=22,K60,IF(P102=23,K60,\"\")))))))))))))))))))))))))))))","v":{"v":2,"d":"2.0"}}]
[]
[]
[{"$nulls":11},"Ściana III"]
[{"$nulls":8},"kN/m2",{"$f":"IF(OR(U102=2,U102=4,U102=7,U102=8,U102=10,U102=11,U102=13,U102=14,U102=15,U102=16,U102=17,U102=18,U102=19,U102=20,U102=21,U102=22,U102=23),N69,IF(U102=1,L69,IF(OR(U102=3,U102=6,U102=12),K72,IF(U102=5,L70,IF(U102=9,L71,\"\")))))","v":{"v":2.1392621695606677,"d":"2.1393"}},{"$f":"IF(OR(U102=11,U102=14,U102=15,U102=17,U102=18,U102=20,U102=21,U102=22,U102=23),N70,IF(U102=1,L69,IF(OR(U102=2,U102=4,U102=7,U102=8),N69,IF(OR(U102=3,U102=6,U102=12,U102=13,U102=19),K72,IF(OR(U102=5,U102=10),L70,IF(OR(U102=9,U102=16),L71,\"\"))))))","v":{"v":2.1392621695606677,"d":"2.1393"}},{"$f":"IF(U102=1,L69,IF(AND(U102=4,L69>=N69),L69,IF(U102=2,N69,IF(AND(U102=4,N69>L69),N69,IF(OR(U102=3,U102=6,U102=8,U102=12,U102=13,U102=15,U102=19,U102=20,U102=23),K72,IF(OR(U102=5,U102=10),L70,IF(AND(U102=17,L70>N70),L70,IF(AND(U102=17,N70>=L70),N70,IF(OR(U102=7,U102=11),N70,IF(OR(U102=9,U102=16,U102=21),L71,IF(OR(U102=14,U102=18,U102=22),N71,\"\")))))))))))","v":{"v":2.1392621695606677,"d":"2.1393"}},{"$f":"IF(OR(U102=9,U102=10,U102=12,U102=16,U102=17,U102=19,U102=21,U102=22,U102=23),L70,IF(U102=2,N69,IF(OR(U102=3,U102=8,U102=13,U102=15,U102=20),K72,IF(OR(U102=1,U102=4,U102=5,U102=6),L69,IF(OR(U102=7,U102=11),N70,IF(OR(U102=14,U102=18),N71,\"\"))))))","v":{"v":2.1392621695606677,"d":"2.1393"}},{"$f":"IF(OR(U102=1,U102=4,U102=5,U102=6,U102=9,U102=10,U102=11,U102=12,U102=13,U102=16,U102=17,U102=18,U102=19,U102=20,U102=21,U102=22,U102=23),L69,IF(U102=2,N69,IF(OR(U102=3,U102=8,U102=15),K72,IF(U102=7,N70,IF(U102=14,N71,\"\")))))","v":{"v":2.1392621695606677,"d":"2.1393"}}]
[]
[]
[]
[]
[{"$nulls":8},"m",{"$f":"IF(U102=1,\"\",IF(U102=2,L60,IF(U102=3,\"\",IF(AND(U102=4,L69=N69,L60>=L61),\"\",IF(AND(U102=4,L69<>N69,L60=L61),L61,IF(AND(U102=4,L60>L61,L69>N69),L61,IF(AND(U102=4,L60>L61,L69<N69),L60,IF(U102=5,\"\",IF(U102=6,\"\",IF(U102=7,L60,IF(U102=8,L60,IF(U102=9,\"\",IF(AND(U102=10,L62=0),L60,IF(AND(U102=10,L62>0,L62<L60,L70>=N69,L71<=N69),L62,IF(AND(U102=10,L62>0,L62<L60,L70<N69),L60,IF(AND(U102=10,L62>0,L62=L60),L60,IF(U102=11,L60,IF(U102=12,\"\",IF(U102=13,L60,IF(U102=14,L60,IF(U102=15,L60,IF(U102=16,L60,IF(U102=17,L60,IF(U102=18,L60,IF(U102=19,L60,IF(U102=20,L60,IF(U102=21,L60,IF(U102=22,L60,IF(U102=23,L60,\"\")))))))))))))))))))))))))))))","v":""},{"$f":"IF(U102=1,\"\",IF(U102=2,\"\",IF(U102=3,\"\",IF(U102=4,\"\",IF(U102=5,\"\",IF(U102=6,\"\",IF(U102=7,\"\",IF(U102=8,\"\",IF(U102=9,\"\",IF(U102=10,\"\",IF(AND(U102=11,L62=0),L61-L60,IF(AND(U102=11,L62>0,L62<L60,N70>=L69,N71<=L69),L61,IF(AND(U102=11,L62>0,L62<L60,N70<L69),L61+L62-L60,IF(AND(U102=11,L62>0,L62=L60),L61,IF(U102=12,\"\",IF(U102=13,\"\",IF(U102=14,L61,IF(U102=15,L61,IF(U102=16,\"\",IF(AND(U102=17,L70>N70),L62-L60,IF(AND(U102=17,N70>L70),L61,IF(AND(U102=17,N70=L70),L61+L62-L60,IF(U102=18,L61,IF(U102=19,\"\",IF(U102=20,L61,IF(U102=21,L61,IF(U102=22,L61,IF(U102=23,L61,\"\"))))))))))))))))))))))))))))","v":""},{"$f":"IF(U102=1,\"\",IF(U102=2,\"\",IF(U102=3,\"\",IF(U102=4,\"\",IF(U102=5,L61,IF(U102=6,L61+L62,IF(U102=7,L61,IF(U102=8,L61+L62,IF(U102=9,L62,IF(U102=10,\"\",IF(U102=11,\"\",IF(U102=12,L62,IF(U102=13,\"\",IF(U102=14,L62,IF(U102=15,L62,IF(U102=16,L62-L60,IF(U102=17,\"\",IF(U102=18,L62-L60,IF(U102=19,L62-L60,IF(U102=20,L62-L60,IF(U102=21,L62-(L60+L61),IF(U102=22,L62-(L60+L61),IF(U102=23,L62-(L60+L61),\"\")))))))))))))))))))))))","v":""},{"$f":"IF(U102=1,\"\",IF(U102=2,\"\",IF(U102=3,\"\",IF(U102=4,\"\",IF(U102=5,\"\",IF(U102=6,\"\",IF(U102=7,\"\",IF(U102=8,\"\",IF(U102=9,L61,IF(AND(U102=10,L62=0),L61-L60,IF(AND(U102=10,L62>0,L62<L60,L70>=N69,L71<=N69),L61,IF(AND(U102=10,L62>0,L62<L60,L70<N69),L61+L62-L60,IF(AND(U102=10,L62>0,L62=L60),L61,IF(U102=11,\"\",IF(U102=12,L61,IF(U102=13,L61+L62-L60,IF(U102=14,\"\",IF(U102=15,\"\",IF(U102=16,L61,IF(AND(U102=17,L70>N70),L61,IF(AND(U102=17,N70>L70),L62-L60,IF(AND(U102=17,N70=L70),\"\",IF(U102=18,\"\",IF(U102=19,L61,IF(U102=20,\"\",IF(U102=21,L61,IF(U102=22,L61,IF(U102=23,L61,\"\"))))))))))))))))))))))))))))","v":""},{"$f":"IF(U102=1,L60,IF(U102=2,\"\",IF(U102=3,L60+L61+L62,IF(AND(U102=4,L69=N69,L60>=L61),L60+L61,IF(AND(U102=4,L69<>N69,L60=L61),L60,IF(AND(U102=4,L60>L61,L69>N69),L60,IF(AND(U102=4,L60>L61,L69<N69),L61,IF(U102=5,L60,IF(U102=6,L60,IF(U102=7,\"\",IF(U102=8,\"\",IF(U102=9,L60,IF(U102=10,L60,IF(AND(U102=11,L62=0),L60,IF(AND(U102=11,L62>0,L62<L60,N70>=L69,N71<=L69),L62,IF(AND(U102=11,L62>0,L62<L60,N70<L69),L60,IF(AND(U102=11,L62>0,L62=L60),L60,IF(U102=12,L60,IF(U102=13,L60,IF(U102=14,\"\",IF(U102=15,\"\",IF(U102=16,L60,IF(U102=17,L60,IF(U102=18,L60,IF(U102=19,L60,IF(U102=20,L60,IF(U102=21,L60,IF(U102=22,L60,IF(U102=23,L60,\"\")))))))))))))))))))))))))))))","v":{"v":10,"d":"10.0"}}]
[]
[]
[]
[{"$nulls":9},{"$f":"TEXT(N60+N61+N62,\"####0,0##\")&\" m\"","v":"10,0 m"}]
[]
[]
[{"$nulls":9},{"$f":"\"Wysokość  ze = \"&TEXT('Obliczenia wiatr I'!D46,\"####0,0##\")&\" m\"","v":"Wysokość  ze = 25,0 m"}]
[]
[]
[]
[]
[{"$nulls":9},"Tablica szerokości pól ściany"]
[]
[{"$nulls":10},"Ściana IV","Ściana I","Ściana II","Ściana III"]
[{"$nulls":9},"a",{"$f":"'Obliczenia wiatr I'!C31","v":{"v":2,"d":"2.0"}},{"$f":"'Obliczenia wiatr I'!D31","v":5.6},{"$f":"'Obliczenia wiatr I'!C31","v":{"v":2,"d":"2.0"}},{"$f":"'Obliczenia wiatr I'!D31","v":5.6}]
[{"$nulls":9},"b",{"$f":"'Obliczenia wiatr I'!C32","v":{"v":8,"d":"8.0"}},{"$f":"'Obliczenia wiatr I'!D32","v":4.4},{"$f":"'Obliczenia wiatr I'!C32","v":{"v":8,"d":"8.0"}},{"$f":"'Obliczenia wiatr I'!D32","v":4.4}]
[{"$nulls":9},"c",{"$f":"'Obliczenia wiatr I'!C33","v":{"v":18,"d":"18.0"}},{"$f":"'Obliczenia wiatr I'!D33","v":{"v":0,"d":"0.0"}},{"$f":"'Obliczenia wiatr I'!C33","v":{"v":18,"d":"18.0"}},{"$f":"'Obliczenia wiatr I'!D33","v":{"v":0,"d":"0.0"}}]
[]
[{"$nulls":9},"e (prost)",{"$f":"'Obliczenia wiatr I'!C25","v":{"v":10,"d":"10.0"}},{"$f":"'Obliczenia wiatr I'!D25","v":{"v":28,"d":"28.0"}},{"$f":"'Obliczenia wiatr I'!C25","v":{"v":10,"d":"10.0"}},{"$f":"'Obliczenia wiatr I'!D25","v":{"v":28,"d":"28.0"}}]
[]
[{"$nulls":9},"Tablica obciążenia wiatrem"]
[]
[{"$nulls":10},"Wiatr 1","Wiatr 2","Wiatr 3","Wiatr 4"]
[{"$nulls":9},"A",{"$f":"'Obliczenia wiatr I'!C90","v":{"v":2.1392621695606677,"d":"2.1393"}},{"$f":"'Obliczenia wiatr I'!D90","v":{"v":2.1392621695606677,"d":"2.1393"}},{"$f":"'Obliczenia wiatr I'!C90","v":{"v":2.1392621695606677,"d":"2.1393"}},{"$f":"'Obliczenia wiatr I'!D90","v":{"v":2.1392621695606677,"d":"2.1393"}}]
[{"$nulls":9},"B",{"$f":"'Obliczenia wiatr I'!C91","v":{"v":1.6808488475119534,"d":"1.6808"}},{"$f":"'Obliczenia wiatr I'!D91","v":{"v":1.6808488475119534,"d":"1.6808"}},{"$f":"'Obliczenia wiatr I'!C91","v":{"v":1.6808488475119534,"d":"1.6808"}},{"$f":"'Obliczenia wiatr I'!D91","v":{"v":1.6808488475119534,"d":"1.6808"}}]
[{"$nulls":9},"C",{"$f":"'Obliczenia wiatr I'!C92","v":{"v":0.7640222034145243,"d":"0.7640"}},{"$f":"'Obliczenia wiatr I'!D92","v":{"v":0,"d":"0.0000"}},{"$f":"'Obliczenia wiatr I'!C92","v":{"v":0.7640222034145243,"d":"0.7640"}},{"$f":"'Obliczenia wiatr I'!D92","v":{"v":0,"d":"0.0000"}}]
[{"$nulls":9},"E",{"$f":"'Obliczenia wiatr I'!C93","v":{"v":0.7203637917902914,"d":"0.7204"}},{"$f":"'Obliczenia wiatr I'!D93","v":{"v":0.8786255339267028,"d":"0.8786"}},{"$f":"'Obliczenia wiatr I'!C93","v":{"v":0.7203637917902914,"d":"0.7204"}},{"$f":"'Obliczenia wiatr I'!D93","v":{"v":0.8786255339267028,"d":"0.8786"}}]
[]
[null,null,"Układy pól obciążenia na ścianach"]
[]
[null,null,"ŚCIANA IV",{"$nulls":4},"ŚCIANA I",{"$nulls":4},"ŚCIANA II",{"$nulls":4},"ŚCIANA III"]
[]
[null,null,1,"A1",null,{"$f":"IF(AND(K60>0,K61=0,K62=0,K69>=M69,L72<=K69),1,0)","v":0},null,1,"A2",null,{"$f":"IF(AND(L60>0,L61=0,L62=0,L69>=N69,M72<=L69),1,0)","v":0},null,1,"A1",null,{"$f":"IF(AND(K60>0,K61=0,K62=0,K69>=M69,N72<=K69),1,0)","v":0},null,1,"A2",null,{"$f":"IF(AND(L60>0,L61=0,L62=0,L69>=N69,K72<=L69),1,0)","v":0}]
[null,null,2,"A3",null,{"$f":"IF(AND(K60>0,K61=0,K62=0,M69>K69,L72<=M69),2,0)","v":0},null,2,"A4",null,{"$f":"IF(AND(L60>0,L61=0,L62=0,N69>L69,M72<=N69),2,0)","v":0},null,2,"A3",null,{"$f":"IF(AND(K60>0,K61=0,K62=0,M69>K69,N72<=M69),2,0)","v":0},null,2,"A4",null,{"$f":"IF(AND(L60>0,L61=0,L62=0,N69>L69,K72<=N69),2,0)","v":0}]
[null,null,3,"E2",null,{"$f":"IF(AND(K60>0,K61>=0,K62>=0,L72>K69,L72>M69),3,0)","v":0},null,3,"E3",null,{"$f":"IF(AND(L60>0,L61>=0,L62>=0,M72>L69,M72>N69),3,0)","v":0},null,3,"E4",null,{"$f":"IF(AND(K60>0,K61>=0,K62>=0,L72>K69,N72>M69),3,0)","v":0},null,3,"E1",null,{"$f":"IF(AND(L60>0,L61>=0,L62>=0,K72>L69,K72>N69),3,0)","v":0}]
[null,null,4,"A1-A3",null,{"$f":"IF(AND(K60>0,K61>0,K62=0,K60>=K61,K69>=M70,M69>=K70,L72<=K69,L72<=M69),4,0)","v":0},null,4,"A2-A4",null,{"$f":"IF(AND(L60>0,L61>0,L62=0,L60>=L61,L69>=N70,N69>=L70,M72<=L69,M72<=N69),4,0)","v":4},null,4,"A1-A3",null,{"$f":"IF(AND(K60>0,K61>0,K62=0,K60>=K61,K69>=M70,M69>=K70,N72<=K69,N72<=M69),4,0)","v":0},null,4,"A2-A4",null,{"$f":"IF(AND(L60>0,L61>0,L62=0,L60>=L61,L69>=N70,N69>=L70,K72<=L69,K72<=N69),4,0)","v":4}]
[null,null,5,"A1-B1",null,{"$f":"IF(AND(K60>0,K61>0,K62=0,K70>=M69,L72<=K70),5,0)","v":0},null,5,"A2-B2",null,{"$f":"IF(AND(L60>0,L61>0,L62=0,L70>=N69,M72<=L70),5,0)","v":0},null,5,"A1-B1",null,{"$f":"IF(AND(K60>0,K61>0,K62=0,K70>=M69,N72<=K70),5,0)","v":0},null,5,"A2-B2",null,{"$f":"IF(AND(L60>0,L61>0,L62=0,L70>=N69,K72<=L70),5,0)","v":0}]
[null,null,6,"A1-E2",null,{"$f":"IF(AND(K60>0,K61>0,K62>=0,L72<K69,L72>K70,L72>M69),6,0)","v":0},null,6,"A2-E3",null,{"$f":"IF(AND(L60>0,L61>0,L62=0,M72<L69,M72>L70,M72>N69),6,0)","v":0},null,6,"A1-E4",null,{"$f":"IF(AND(K60>0,K61>0,K62>=0,N72<K69,N72>K70,N72>M69),6,0)","v":0},null,6,"A2-E1",null,{"$f":"IF(AND(L60>0,L61>0,L62=0,K72<L69,K72>L70,K72>N69),6,0)","v":0}]
[null,null,7,"B3-A3",null,{"$f":"IF(AND(K60>0,K61>0,K62=0,M70>=K69,L72<=M70),7,0)","v":0},null,7,"B4-A4",null,{"$f":"IF(AND(L60>0,L61>0,L62=0,N70>=L69,M72<=N70),7,0)","v":0},null,7,"B3-A3",null,{"$f":"IF(AND(K60>0,K61>0,K62=0,M70>=K69,N72<=M70),7,0)","v":0},null,7,"B4-A4",null,{"$f":"IF(AND(L60>0,L61>0,L62=0,N70>=L69,K72<=N70),7,0)","v":0}]
[null,null,8,"E2-A3",null,{"$f":"IF(AND(K60>0,K61>0,K62>=0,L72<M69,L72>M70,L72>K69),8,0)","v":0},null,8,"E3-A4",null,{"$f":"IF(AND(L60>0,L61>0,L62>=0,M72<N69,M72>N70,M72>L69),8,0)","v":0},null,8,"E4-A3",null,{"$f":"IF(AND(K60>0,K61>0,K62>=0,N72<M69,N72>M70,N72>K69),8,0)","v":0},null,8,"E1-A4",null,{"$f":"IF(AND(L60>0,L61>0,L62>=0,K72<N69,K72>N70,K72>L69),8,0)","v":0}]
[null,null,9,"A1-B1-C1",null,{"$f":"IF(AND(K60>0,K61>0,K62>0,K71>=M69,L72<=K71),9,0)","v":0},null,9,"A2-B2-C2",null,{"$f":"IF(AND(L60>0,L61>0,L62>0,L71>=N69,M72<=L71),9,0)","v":0},null,9,"A1-B1-C1",null,{"$f":"IF(AND(K60>0,K61>0,K62>0,K71>=M69,N72<=K71),9,0)","v":0},null,9,"A2-B2-C2",null,{"$f":"IF(AND(L60>0,L61>0,L62>0,L71>=N69,K72<=L71),9,0)","v":0}]
[null,null,10,"A1-B1-A3",null,{"$f":"IF(AND(K60>0,K61>0,K62>=0,K62<=K60,K60<K61,K70>=M70,IF(K62=0,M69>K70,M69>K71),L72<=K70,L72<=M69),10,0)","v":0},null,10,"A2-B2-A4",null,{"$f":"IF(AND(L60>0,L61>0,L62>=0,L62<=L60,L60<L61,L70>=N70,IF(L62=0,N69>L70,N69>L71),M72<=L70,M72<=N69),10,0)","v":0},null,10,"A1-B1-A3",null,{"$f":"IF(AND(K60>0,K61>0,K62>=0,K62<=K60,K60<K61,K70>=M70,IF(K62=0,M69>K70,M69>K71),N72<=K70,N72<=M69),10,0)","v":0},null,10,"A2-B2-A4",null,{"$f":"IF(AND(L60>0,L61>0,L62>=0,L62<=L60,L60<L61,L70>=N70,IF(L62=0,N69>L70,N69>L71),K72<=L70,K72<=N69),10,0)","v":0}]
[null,null,11,"A1-B3-A3",null,{"$f":"IF(AND(K60>0,K61>0,K62>=0,K62<=K60,K60<K61,M70>K70,IF(K62=0,K69>M70,K69>M71),L72<=M70,L72<=K69),11,0)","v":0},null,11,"A2-B4-A4",null,{"$f":"IF(AND(L60>0,L61>0,L62>=0,L62<=L60,L60<L61,N70>L70,IF(L62=0,L69>N70,L69>N71),M72<=N70,M72<=L69),11,0)","v":0},null,11,"A1-B3-A3",null,{"$f":"IF(AND(K60>0,K61>0,K62>=0,K62<=K60,K60<K61,M70>K70,IF(K62=0,K69>M70,K69>M71),N72<=M70,N72<=K69),11,0)","v":0},null,11,"A2-B4-A4",null,{"$f":"IF(AND(L60>0,L61>0,L62>=0,L62<=L60,L60<L61,N70>L70,IF(L62=0,L69>N70,L69>N71),K72<=N70,K72<=L69),11,0)","v":0}]
[null,null,12,"A1-B1-E2",null,{"$f":"IF(AND(K60>0,K61>0,K62>0,L72<K70,L72>M69,L72>K71),12,0)","v":0},null,12,"A2-B2-E3",null,{"$f":"IF(AND(L60>0,L61>0,L62>0,M72<L70,M72>N69,M72>L71),12,0)","v":0},null,12,"A1-B1-E4",null,{"$f":"IF(AND(K60>0,K61>0,K62>0,L72<K70,N72>M69,N72>K71),12,0)","v":0},null,12,"A2-B2-E1",null,{"$f":"IF(AND(L60>0,L61>0,L62>0,K72<L70,K72>N69,K72>L71),12,0)","v":0}]
[null,null,13,"A1-E2-A3",null,{"$f":"IF(AND(K60>0,K60<K61,K62>=0,L72<K69,L72<M69,L72>K70,L72>M70),13,0)","v":0},null,13,"A2-E3-A4",null,{"$f":"IF(AND(L60>0,L60<L61,L62>=0,M72<L69,M72<N69,M72>L70,M72>N70),13,0)","v":0},null,13,"A1-E4-A3",null,{"$f":"IF(AND(K60>0,K60<K61,K62>=0,N72<K69,N72<M69,N72>K70,N72>M70),13,0)","v":0},null,13,"A2-E1-A4",null,{"$f":"IF(AND(L60>0,L60<L61,L62>=0,K72<L69,K72<N69,K72>L70,K72>N70),13,0)","v":0}]
[null,null,14,"C3-B3-A3",null,{"$f":"IF(AND(K60>0,K61>0,K62>0,M71>=K69,L72<=M71),14,0)","v":0},null,14,"C4-B4-A4",null,{"$f":"IF(AND(L60>0,L61>0,L62>0,N71>=L69,M72<=N71),14,0)","v":0},null,14,"C3-B3-A3",null,{"$f":"IF(AND(K60>0,K61>0,K62>0,M71>=K69,N72<=M71),14,0)","v":0},null,14,"C4-B4-A4",null,{"$f":"IF(AND(L60>0,L61>0,L62>0,N71>=L69,K72<=N71),14,0)","v":0}]
[null,null,15,"E2-B3-A3",null,{"$f":"IF(AND(K60>0,K61>0,K62>0,L72<M70,L72>K69,L72>M71),15,0)","v":0},null,15,"E3-B4-A4",null,{"$f":"IF(AND(L60>0,L61>0,L62>0,M72<N70,M72>L69,M72>N71),15,0)","v":0},null,15,"E4-B3-A3",null,{"$f":"IF(AND(K60>0,K61>0,K62>0,N72<M70,N72>K69,N72>M71),15,0)","v":0},null,15,"E1-B4-A4",null,{"$f":"IF(AND(L60>0,L61>0,L62>0,K72<N70,K72>L69,K72>N71),15,0)","v":0}]
[null,null,16,"A1-B1-C1-A3",null,{"$f":"IF(AND(K60>0,K61>0,K62>0,K62>K60,K71>=M70,K71<M69,L72<=K71),16,0)","v":0},null,16,"A2-B2-C2-A4",null,{"$f":"IF(AND(L60>0,L61>0,L62>0,L62>L60,L71>=N70,L71<N69,M72<=L71),16,0)","v":0},null,16,"A1-B1-C1-A3",null,{"$f":"IF(AND(K60>0,K61>0,K62>0,K62>K60,K71>=M70,K71<M69,N72<=K71),16,0)","v":0},null,16,"A2-B2-C2-A4",null,{"$f":"IF(AND(L60>0,L61>0,L62>0,L62>L60,L71>=N70,L71<N69,K72<=L71),16,0)","v":0}]
[null,null,17,"A1-B1-B3-A3",null,{"$f":"IF(AND(K60>0,K61>0,K62>0,K62>K60,K62<=K60+K61,K71<M70,M71<K70,L72<=M70,L72<=K70),17,0)","v":0},null,17,"A2-B2-B4-A4",null,{"$f":"IF(AND(L60>0,L61>0,L62>0,L62>L60,L62<=L60+L61,L71<N70,N71<L70,M72<=N70,M72<=L70),17,0)","v":0},null,17,"A1-B1-B3-A3",null,{"$f":"IF(AND(K60>0,K61>0,K62>0,K62>K60,K62<=K60+K61,K71<M70,M71<K70,N72<=M70,N72<=K70),17,0)","v":0},null,17,"A2-B2-B4-A4",null,{"$f":"IF(AND(L60>0,L61>0,L62>0,L62>L60,L62<=L60+L61,L71<N70,N71<L70,K72<=N70,K72<=L70),17,0)","v":0}]
[null,null,18,"A1-C3-B3-A3",null,{"$f":"IF(AND(K60>0,K61>0,K62>0,K62>K60,M71>=K70,M71<K69,L72<=M71),18,0)","v":0},null,18,"A2-C4-B4-A4",null,{"$f":"IF(AND(L60>0,L61>0,L62>0,L62>L60,N71>=L70,N71<L69,M72<=N71),18,0)","v":0},null,18,"A1-C3-B3-A3",null,{"$f":"IF(AND(K60>0,K61>0,K62>0,K62>K60,M71>=K70,M71<K69,N72<=M71),18,0)","v":0},null,18,"A2-C4-B4-A4",null,{"$f":"IF(AND(L60>0,L61>0,L62>0,L62>L60,N71>=L70,N71<L69,K72<=N71),18,0)","v":0}]
[null,null,19,"A1-B1-E2-A3",null,{"$f":"IF(AND(K60>0,K61>0,K62>0,K62>K60,L72<M69,L72>K71,L72>M70,L72<K70),19,0)","v":0},null,19,"A2-B2-E3-A4",null,{"$f":"IF(AND(L60>0,L61>0,L62>0,L62>L60,M72<N69,M72>L71,M72>N70,M72<L70),19,0)","v":0},null,19,"A1-B1-E4-A3",null,{"$f":"IF(AND(K60>0,K61>0,K62>0,K62>K60,N72<M69,N72>K71,N72>M70,N72<K70),19,0)","v":0},null,19,"A2-B2-E1-A4",null,{"$f":"IF(AND(L60>0,L61>0,L62>0,L62>L60,K72<N69,K72>L71,K72>N70,K72<L70),19,0)","v":0}]
[null,null,20,"A1-E2-B3-A3",null,{"$f":"IF(AND(K60>0,K61>0,K62>0,K62>K60,L72<K69,L72>M71,L72>K70,L72<M70),20,0)","v":0},null,20,"A2-E3-B4-A4",null,{"$f":"IF(AND(L60>0,L61>0,L62>0,L62>L60,M72<L69,M72>N71,M72>L70,M72<N70),20,0)","v":0},null,20,"A1-E4-B3-A3",null,{"$f":"IF(AND(K60>0,K61>0,K62>0,K62>K60,N72<K69,N72>M71,N72>K70,N72<M70),20,0)","v":0},null,20,"A2-E1-B4-A4",null,{"$f":"IF(AND(L60>0,L61>0,L62>0,L62>L60,K72<L69,K72>N71,K72>L70,K72<N70),20,0)","v":0}]
[null,null,21,"A1-B1-C1-B3-A3",null,{"$f":"IF(AND(K60>0,K61>0,K62>0,K62>K60+K61,M71<K70,K71<M70,K71>=M71,L72<=K71),21,0)","v":0},null,21,"A2-B2-C2-B4-A4",null,{"$f":"IF(AND(L60>0,L61>0,L62>0,L62>L60+L61,N71<L70,L71<N70,L71>=N71,M72<=L71),21,0)","v":0},null,21,"A1-B1-C1-B3-A3",null,{"$f":"IF(AND(K60>0,K61>0,K62>0,K62>K60+K61,M71<K70,K71<M70,K71>=M71,N72<=K71),21,0)","v":0},null,21,"A2-B2-C2-B4-A4",null,{"$f":"IF(AND(L60>0,L61>0,L62>0,L62>L60+L61,N71<L70,L71<N70,L71>=N71,K72<=L71),21,0)","v":0}]
[null,null,22,"A1-B1-C3-B3-A3",null,{"$f":"IF(AND(K60>0,K61>0,K62>0,K62>K60+K61,M71<K70,K71<M70,K71<M71,L72<=M71),22,0)","v":0},null,22,"A2-B2-C4-B4-A4",null,{"$f":"IF(AND(L60>0,L61>0,L62>0,L62>L60+L61,N71<L70,L71<N70,L71<N71,M72<=N71),22,0)","v":0},null,22,"A1-B1-C3-B3-A3",null,{"$f":"IF(AND(K60>0,K61>0,K62>0,K62>K60+K61,M71<K70,K71<M70,K71<M71,N72<=M71),22,0)","v":0},null,22,"A2-B2-C4-B4-A4",null,{"$f":"IF(AND(L60>0,L61>0,L62>0,L62>L60+L61,N71<L70,L71<N70,L71<N71,K72<=N71),22,0)","v":0}]
[null,null,23,"A1-B1-E2-B3-A3",null,{"$f":"IF(AND(K60>0,K61>0,K62>0,K62>K60+K61,L72<K70,L72<M70,L72>K71,L72>M71),23,0)","v":23},null,23,"A2-B2-E3-B4-A4",null,{"$f":"IF(AND(L60>0,L61>0,L62>0,L62>L60+L61,M72<L70,M72<N70,M72>L71,M72>N71),23,0)","v":0},null,23,"A1-B1-E4-B3-A3",null,{"$f":"IF(AND(K60>0,K61>0,K62>0,K62>K60+K61,N72<K70,N72<M70,N72>K71,N72>M71),23,0)","v":23},null,23,"A2-B2-E1-B4-A4",null,{"$f":"IF(AND(L60>0,L61>0,L62>0,L62>L60+L61,K72<L70,K72<N70,K72>L71,K72>N71),23,0)","v":0}]
[]
[null,null,"Występujący przypadek",null,null,{"$f":"MAX(F78:F100)","v":23},null,"Występujący przypadek",null,null,{"$f":"MAX(K78:K100)","v":4},null,"Występujący przypadek",null,null,{"$f":"MAX(P78:P100)","v":23},null,"Występujący przypadek",null,null,{"$f":"MAX(U78:U100)","v":4}]
[]
[null,null,"UWAGA! Na każdej ścianie nie może jednocześnie wystąpić więcej niż jeden przypadek układu pól obciążenia. Zaleca się sprawdzenie, czy w poszczególnych kolumnach występuje tylko jedna wartość różna od zera. Występowanie kilku wartości różnych od zera, będzie świadczyć o błędzie w programie. W takiej sytuacji zaleca się nieznaczną zmianę wymiarów budynku."]

{"sheet":"Wyniki graficzne wiatr II","index":8,"n_rows":104,"n_cols":21,"rows_kept":104,"merged":[[1,1,2,21],[3,1,3,21],[5,1,5,21],[7,9,9,13],[10,8,13,8],[10,9,13,9],[10,10,13,10],[10,11,13,11],[10,12,13,12],[10,13,13,13],[14,8,17,8],[14,9,18,9],[14,10,18,10],[14,11,18,11],[14,12,18,12],[14,13,18,13],[18,7,18,8],[18,14,18,15],[19,4,38,4],[19,5,38,5],[19,6,22,6],[19,7,22,8],[19,10,38,10],[19,14,22,15],[19,16,22,16],[19,17,38,17],[20,9,21,9],[23,6,26,6],[23,7,26,8],[23,14,26,15],[23,16,26,16],[24,9,25,9],[27,6,30,6],[27,7,30,8],[27,14,30,15],[27,16,30,16],[28,9,29,9],[28,11,29,11],[28,13,29,13],[31,6,34,6],[31,7,34,8],[31,14,34,15],[31,16,34,16],[32,9,33,9],[35,6,38,6],[35,7,38,8],[35,14,38,15],[35,16,38,16],[36,9,37,9],[39,8,43,8],[39,9,43,9],[39,10,43,10],[39,11,43,11],[39,12,43,12],[39,13,43,13],[44,8,47,8],[44,9,47,9],[44,10,47,10],[44,11,47,11],[44,12,47,12],[44,13,47,13],[48,9,50,13],[51,9,53,13],[56,9,56,13],[65,9,65,13],[73,2,73,20],[75,2,75,5],[75,7,75,10],[75,12,75,15],[75,17,75,20],[77,3,77,4],[77,8,77,9],[77,13,77,14],[77,18,77,19],[78,3,78,4],[78,8,78,9],[78,13,78,14],[78,18,78,19],[79,3,79,4],[79,8,79,9],[79,13,79,14],[79,18,79,19],[80,3,80,4],[80,8,80,9],[80,13,80,14],[80,18,80,19],[81,3,81,4],[81,8,81,9],[81,13,81,14],[81,18,81,19],[82,3,82,4],[82,8,82,9],[82,13,82,14],[82,18,82,19],[83,3,83,4],[83,8,83,9],[83,13,83,14],[83,18,83,19],[84,3,84,4],[84,8,84,9],[84,13,84,14],[84,18,84,19],[85,3,85,4],[85,8,85,9],[85,13,85,14],[85,18,85,19],[86,3,86,4],[86,8,86,9],[86,13,86,14],[86,18,86,19],[87,3,87,4],[87,8,87,9],[87,13,87,14],[87,18,87,19],[88,3,88,4],[88,8,88,9],[88,13,88,14],[88,18,88,19],[89,3,89,4],[89,8,89,9],[89,13,89,14],[89,18,89,19],[90,3,90,4],[90,8,90,9],[90,13,90,14],[90,18,90,19],[91,3,91,4],[91,8,91,9],[91,13,91,14],[91,18,91,19],[92,3,92,4],[92,8,92,9],[92,13,92,14],[92,18,92,19],[93,3,93,4],[93,8,93,9],[93,13,93,14],[93,18,93,19],[94,3,94,4],[94,8,94,9],[94,13,94,14],[94,18,94,19],[95,3,95,4],[95,8,95,9],[95,13,95,14],[95,18,95,19],[96,3,96,4],[96,8,96,9],[96,13,96,14],[96,18,96,19],[97,3,97,4],[97,8,97,9],[97,13,97,14],[97,18,97,19],[98,3,98,4],[98,8,98,9],[98,13,98,14],[98,18,98,19],[99,3,99,4],[99,8,99,9],[99,13,99,14],[99,18,99,19],[101,2,101,4],[101,7,101,9],[101,12,101,14],[101,17,101,19],[103,2,104,20]]}
[]
[null,"Graficzne przedstawienie wyników obliczeń oddziaływania wiatru"]
[]
[null,"Wiatr II - różne warunki w zależności od kierunku"]
[]
[null,"UWAGA! Wymiary rzutu budynku i szerokości pól ściany nie są pokazywane w skali."]
[]
[{"$nulls":9},{"$f":"\"Wysokość  ze = \"&TEXT('Obliczenia wiatr II'!E42,\"####0,0##\")&\" m\"","v":"Wysokość  ze = 25,0 m"}]
[]
[]
[{"$nulls":8},"m",{"$f":"IF(K102=1,\"\",IF(K102=2,L60,IF(K102=3,\"\",IF(AND(K102=4,L69=N69,L60>=L61),\"\",IF(AND(K102=4,L69<>N69,L60=L61),L61,IF(AND(K102=4,L60>L61,L69>N69),L61,IF(AND(K102=4,L60>L61,L69<N69),L60,IF(K102=5,\"\",IF(K102=6,\"\",IF(K102=7,L60,IF(K102=8,L60,IF(K102=9,\"\",IF(AND(K102=10,L62=0),L60,IF(AND(K102=10,L62>0,L62<L60,L70>=N69,L71<=N69),L62,IF(AND(K102=10,L62>0,L62<L60,L70<N69),L60,IF(AND(K102=10,L62>0,L62=L60),L60,IF(K102=11,L60,IF(K102=12,\"\",IF(K102=13,L60,IF(K102=14,L60,IF(K102=15,L60,IF(K102=16,L60,IF(K102=17,L60,IF(K102=18,L60,IF(K102=19,L60,IF(K102=20,L60,IF(K102=21,L60,IF(K102=22,L60,IF(K102=23,L60,\"\")))))))))))))))))))))))))))))","v":5.6},{"$f":"IF(K102=1,\"\",IF(K102=2,\"\",IF(K102=3,\"\",IF(K102=4,\"\",IF(K102=5,\"\",IF(K102=6,\"\",IF(K102=7,\"\",IF(K102=8,\"\",IF(K102=9,\"\",IF(K102=10,\"\",IF(AND(K102=11,L62=0),L61-L60,IF(AND(K102=11,L62>0,L62<L60,N70>=L69,N71<=L69),L61,IF(AND(K102=11,L62>0,L62<L60,N70<L69),L61+L62-L60,IF(AND(K102=11,L62>0,L62=L60),L61,IF(K102=12,\"\",IF(K102=13,\"\",IF(K102=14,L61,IF(K102=15,L61,IF(K102=16,\"\",IF(AND(K102=17,L70>N70),L62-L60,IF(AND(K102=17,N70>=L70),L61,IF(K102=18,L61,IF(K102=19,\"\",IF(K102=20,L61,IF(K102=21,L61,IF(K102=22,L61,IF(K102=23,L61,\"\")))))))))))))))))))))))))))","v":""},{"$f":"IF(K102=1,\"\",IF(K102=2,\"\",IF(K102=3,\"\",IF(K102=4,\"\",IF(K102=5,L61,IF(K102=6,L61+L62,IF(K102=7,L61,IF(K102=8,L61+L62,IF(K102=9,L62,IF(K102=10,\"\",IF(K102=11,\"\",IF(K102=12,L62,IF(K102=13,\"\",IF(K102=14,L62,IF(K102=15,L62,IF(K102=16,L62-L60,IF(K102=17,\"\",IF(K102=18,L62-L60,IF(K102=19,L62-L60,IF(K102=20,L62-L60,IF(K102=21,L62-(L60+L61),IF(K102=22,L62-(L60+L61),IF(K102=23,L62-(L60+L61),\"\")))))))))))))))))))))))","v":4.4},{"$f":"IF(K102=1,\"\",IF(K102=2,\"\",IF(K102=3,\"\",IF(K102=4,\"\",IF(K102=5,\"\",IF(K102=6,\"\",IF(K102=7,\"\",IF(K102=8,\"\",IF(K102=9,L61,IF(AND(K102=10,L62=0),L61-L60,IF(AND(K102=10,L62>0,L62<L60,L70>=N69,L71<=N69),L61,IF(AND(K102=10,L62>0,L62<L60,L70<N69),L61+L62-L60,IF(AND(K102=10,L62>0,L62=L60),L61,IF(K102=11,\"\",IF(K102=12,L61,IF(K102=13,L61+L62-L60,IF(K102=14,\"\",IF(K102=15,\"\",IF(K102=16,L61,IF(AND(K102=17,L70>N70),L61,IF(AND(K102=17,N70>=L70),L62-L60,IF(K102=18,\"\",IF(K102=19,L61,IF(K102=20,\"\",IF(K102=21,L61,IF(K102=22,L61,IF(K102=23,L61,\"\")))))))))))))))))))))))))))","v":""},{"$f":"IF(K102=1,L60,IF(K102=2,\"\",IF(K102=3,L60+L61+L62,IF(AND(K102=4,L69=N69,L60>=L61),L60+L61,IF(AND(K102=4,L69<>N69,L60=L61),L60,IF(AND(K102=4,L60>L61,L69>N69),L60,IF(AND(K102=4,L60>L61,L69<N69),L61,IF(K102=5,L60,IF(K102=6,L60,IF(K102=7,\"\",IF(K102=8,\"\",IF(K102=9,L60,IF(K102=10,L60,IF(AND(K102=11,L62=0),L60,IF(AND(K102=11,L62>0,L62<L60,N70>=L69,N71<=L69),L62,IF(AND(K102=11,L62>0,L62<L60,N70<L69),L60,IF(AND(K102=11,L62>0,L62=L60),L60,IF(K102=12,L60,IF(K102=13,L60,IF(K102=14,\"\",IF(K102=15,\"\",IF(K102=16,L60,IF(K102=17,L60,IF(K102=18,L60,IF(K102=19,L60,IF(K102=20,L60,IF(K102=21,L60,IF(K102=22,L60,IF(K102=23,L60,\"\")))))))))))))))))))))))))))))","v":""}]
[]
[]
[]
[{"$nulls":8},"kN/m2",{"$f":"IF(OR(K102=2,K102=4,K102=7,K102=8,K102=10,K102=11,K102=13,K102=14,K102=15,K102=16,K102=17,K102=18,K102=19,K102=20,K102=21,K102=22,K102=23),N69,IF(K102=1,L69,IF(OR(K102=3,K102=6,K102=12),M72,IF(K102=5,L70,IF(K102=9,L71,\"\")))))","v":{"v":2.1392621695606677,"d":"2.1393"}},{"$f":"IF(OR(K102=11,K102=14,K102=15,K102=17,K102=18,K102=20,K102=21,K102=22,K102=23),N70,IF(K102=1,L69,IF(OR(K102=2,K102=4,K102=7,K102=8),N69,IF(OR(K102=3,K102=6,K102=12,K102=13,K102=19),M72,IF(OR(K102=5,K102=10),L70,IF(OR(K102=9,K102=16),L71,\"\"))))))","v":{"v":2.1392621695606677,"d":"2.1393"}},{"$f":"IF(K102=1,L69,IF(AND(K102=4,L69>=N69),L69,IF(K102=2,N69,IF(AND(K102=4,N69>L69),N69,IF(OR(K102=3,K102=6,K102=8,K102=12,K102=13,K102=15,K102=19,K102=20,K102=23),M72,IF(OR(K102=5,K102=10),L70,IF(AND(K102=17,L70>N70),L70,IF(AND(K102=17,N70>=L70),N70,IF(OR(K102=7,K102=11),N70,IF(OR(K102=9,K102=16,K102=21),L71,IF(OR(K102=14,K102=18,K102=22),N71,\"\")))))))))))","v":{"v":1.6808488475119534,"d":"1.6808"}},{"$f":"IF(OR(K102=9,K102=10,K102=12,K102=16,K102=17,K102=19,K102=21,K102=22,K102=23),L70,IF(K102=2,N69,IF(OR(K102=3,K102=8,K102=13,K102=15,K102=20),M72,IF(OR(K102=1,K102=4,K102=5,K102=6),L69,IF(OR(K102=7,K102=11),N70,IF(OR(K102=14,K102=18),N71,\"\"))))))","v":{"v":1.6808488475119534,"d":"1.6808"}},{"$f":"IF(OR(K102=1,K102=4,K102=5,K102=6,K102=9,K102=10,K102=11,K102=12,K102=13,K102=16,K102=17,K102=18,K102=19,K102=20,K102=21,K102=22,K102=23),L69,IF(K102=2,N69,IF(OR(K102=3,K102=8,K102=15),M72,IF(K102=7,N70,IF(K102=14,N71,\"\")))))","v":{"v":1.6808488475119534,"d":"1.6808"}}]
[]
[]
[]
[{"$nulls":6},"m","kN/m2",{"$nulls":6},"kN/m2",null,"m"]
[{"$nulls":4},{"$f":"\"Wysokość  ze = \"&TEXT('Obliczenia wiatr II'!D42,\"####0,0##\")&\" m\"","v":"Wysokość  ze = 25,0 m"},{"$f":"TEXT(K60+K61+K62,\"####0,0##\")&\" m\"","v":"28,0 m"},{"$f":"IF(F102=1,K60,IF(F102=2,\"\",IF(F102=3,K60+K61+K62,IF(AND(F102=4,K69=M69,K60>=K61),K60+K61,IF(AND(F102=4,K69<>M69,K60=K61),K60,IF(AND(F102=4,K60>K61,K69>M69),K60,IF(AND(F102=4,K60>K61,K69<M69),K61,IF(F102=5,K60,IF(F102=6,K60,IF(F102=7,\"\",IF(F102=8,\"\",IF(F102=9,K60,IF(F102=10,K60,IF(AND(F102=11,K62=0),K60,IF(AND(F102=11,K62>0,K62<K60,M70>=K69,M71<=K69),K62,IF(AND(F102=11,K62>0,K62<K60,M70<K69),K60,IF(AND(F102=11,K62>0,K62=K60),K60,IF(F102=12,K60,IF(F102=13,K60,IF(F102=14,\"\",IF(F102=15,\"\",IF(F102=16,K60,IF(F102=17,K60,IF(F102=18,K60,IF(F102=19,K60,IF(F102=20,K60,IF(F102=21,K60,IF(F102=22,K60,IF(F102=23,K60,\"\")))))))))))))))))))))))))))))","v":{"v":2,"d":"2.0"}},{"$f":"IF(OR(F102=1,F102=4,F102=5,F102=6,F102=9,F102=10,F102=11,F102=12,F102=13,F102=16,F102=17,F102=18,F102=19,F102=20,F102=21,F102=22,F102=23),K69,IF(F102=2,M69,IF(OR(F102=3,F102=8,F102=15),L72,IF(F102=7,M70,IF(F102=14,M71,\"\")))))","v":{"v":2.1392621695606677,"d":"2.1393"}},null,null,{"$f":"\"Przyjęta oś budynku, odchylona o kąt \"&TEXT('Obliczenia wiatr II'!C11,\"####0,0##\")&\"° od kierunku N\"","v":"Przyjęta oś budynku, odchylona o kąt 10,0° od kierunku N"},"Ściana I",null,null,{"$f":"IF(OR(P102=1,P102=4,P102=5,P102=6,P102=9,P102=10,P102=11,P102=12,P102=13,P102=16,P102=17,P102=18,P102=19,P102=20,P102=21,P102=22,P102=23),K69,IF(P102=2,M69,IF(OR(P102=3,P102=8,P102=15),N72,IF(P102=7,M70,IF(P102=14,M71,\"\")))))","v":{"v":2.1392621695606677,"d":"2.1393"}},null,{"$f":"IF(P102=1,K60,IF(P102=2,\"\",IF(P102=3,K60+K61+K62,IF(AND(P102=4,K69=M69,K60>=K61),K60+K61,IF(AND(P102=4,K69<>M69,K60=K61),K60,IF(AND(P102=4,K60>K61,K69>M69),K60,IF(AND(P102=4,K60>K61,K69<M69),K61,IF(P102=5,K60,IF(P102=6,K60,IF(P102=7,\"\",IF(P102=8,\"\",IF(P102=9,K60,IF(P102=10,K60,IF(AND(P102=11,K62=0),K60,IF(AND(P102=11,K62>0,K62<K60,M70>=K69,M71<=K69),K62,IF(AND(P102=11,K62>0,K62<K60,M70<K69),K60,IF(AND(P102=11,K62>0,K62=K60),K60,IF(P102=12,K60,IF(P102=13,K60,IF(P102=14,\"\",IF(P102=15,\"\",IF(P102=16,K60,IF(P102=17,K60,IF(P102=18,K60,IF(P102=19,K60,IF(P102=20,K60,IF(P102=21,K60,IF(P102=22,K60,IF(P102=23,K60,\"\")))))))))))))))))))))))))))))","v":{"v":2,"d":"2.0"}},{"$f":"\"Wysokość  ze = \"&TEXT('Obliczenia wiatr II'!D42,\"####0,0##\")&\" m\"","v":"Wysokość  ze = 25,0 m"}]
[]
[]
[]
[{"$nulls":6},{"$f":"IF(F102=1,\"\",IF(F102=2,\"\",IF(F102=3,\"\",IF(F102=4,\"\",IF(F102=5,\"\",IF(F102=6,\"\",IF(F102=7,\"\",IF(F102=8,\"\",IF(F102=9,K61,IF(AND(F102=10,K62=0),K61-K60,IF(AND(F102=10,K62>0,K62<K60,K70>=M69,K71<=M69),K61,IF(AND(F102=10,K62>0,K62<K60,K70<M69),K61+K62-K60,IF(AND(F102=10,K62>0,K62=K60),K61,IF(F102=11,\"\",IF(F102=12,K61,IF(F102=13,K61+K62-K60,IF(F102=14,\"\",IF(F102=15,\"\",IF(F102=16,K61,IF(AND(F102=17,K70>M70),K61,IF(AND(F102=17,M70>=K70),K62-K60,IF(F102=18,\"\",IF(F102=19,K61,IF(F102=20,\"\",IF(F102=21,K61,IF(F102=22,K61,IF(F102=23,K61,\"\")))))))))))))))))))))))))))","v":{"v":8,"d":"8.0"}},{"$f":"IF(OR(F102=9,F102=10,F102=12,F102=16,F102=17,F102=19,F102=21,F102=22,F102=23),K70,IF(F102=2,M69,IF(OR(F102=3,F102=8,F102=13,F102=15,F102=20),L72,IF(OR(F102=1,F102=4,F102=5,F102=6),K69,IF(OR(F102=7,F102=11),M70,IF(OR(F102=14,F102=18),M71,\"\"))))))","v":{"v":1.6808488475119534,"d":"1.6808"}},{"$nulls":6},{"$f":"IF(OR(P102=9,P102=10,P102=12,P102=16,P102=17,P102=19,P102=21,P102=22,P102=23),K70,IF(P102=2,M69,IF(OR(P102=3,P102=8,P102=13,P102=15,P102=20),N72,IF(OR(P102=1,P102=4,P102=5,P102=6),K69,IF(OR(P102=7,P102=11),M70,IF(OR(P102=14,P102=18),M71,\"\"))))))","v":{"v":1.6808488475119534,"d":"1.6808"}},null,{"$f":"IF(P102=1,\"\",IF(P102=2,\"\",IF(P102=3,\"\",IF(P102=4,\"\",IF(P102=5,\"\",IF(P102=6,\"\",IF(P102=7,\"\",IF(P102=8,\"\",IF(P102=9,K61,IF(AND(P102=10,K62=0),K61-K60,IF(AND(P102=10,K62>0,K62<K60,K70>=M69,K71<=M69),K61,IF(AND(P102=10,K62>0,K62<K60,K70<M69),K61+K62-K60,IF(AND(P102=10,K62>0,K62=K60),K61,IF(P102=11,\"\",IF(P102=12,K61,IF(P102=13,K61+K62-K60,IF(P102=14,\"\",IF(P102=15,\"\",IF(P102=16,K61,IF(AND(P102=17,K70>M70),K61,IF(AND(P102=17,M70>=K70),K62-K60,IF(P102=18,\"\",IF(P102=19,K61,IF(P102=20,\"\",IF(P102=21,K61,IF(P102=22,K61,IF(P102=23,K61,\"\")))))))))))))))))))))))))))","v":{"v":8,"d":"8.0"}}]
[]
[]
[]
[{"$nulls":6},{"$f":"IF(F102=1,\"\",IF(F102=2,\"\",IF(F102=3,\"\",IF(F102=4,\"\",IF(F102=5,K61,IF(F102=6,K61+K62,IF(F102=7,K61,IF(F102=8,K61+K62,IF(F102=9,K62,IF(F102=10,\"\",IF(F102=11,\"\",IF(F102=12,K62,IF(F102=13,\"\",IF(F102=14,K62,IF(F102=15,K62,IF(F102=16,K62-K60,IF(F102=17,\"\",IF(F102=18,K62-K60,IF(F102=19,K62-K60,IF(F102=20,K62-K60,IF(F102=21,K62-(K60+K61),IF(F102=22,K62-(K60+K61),IF(F102=23,K62-(K60+K61),\"\")))))))))))))))))))))))","v":{"v":8,"d":"8.0"}},{"$f":"IF(F102=1,K69,IF(AND(F102=4,K69>=M69),K69,IF(F102=2,M69,IF(AND(F102=4,M69>K69),M69,IF(OR(F102=3,F102=6,F102=8,F102=12,F102=13,F102=15,F102=19,F102=20,F102=23),L72,IF(OR(F102=5,F102=10),K70,IF(AND(F102=17,K70>M70),K70,IF(AND(F102=17,M70>=K70),M70,IF(OR(F102=7,F102=11),M70,IF(OR(F102=9,F102=16,F102=21),K71,IF(OR(F102=14,F102=18,F102=22),M71,\"\")))))))))))","v":{"v":0.7640222034145243,"d":"0.7640"}},{"$nulls":6},{"$f":"IF(P102=1,K69,IF(AND(P102=4,K69>=M69),K69,IF(P102=2,M69,IF(AND(P102=4,M69>K69),M69,IF(OR(P102=3,P102=6,P102=8,P102=12,P102=13,P102=15,P102=19,P102=20,P102=23),N72,IF(OR(P102=5,P102=10),K70,IF(AND(P102=17,K70>M70),K70,IF(AND(P102=17,M70>=K70),M70,IF(OR(P102=7,P102=11),M70,IF(OR(P102=9,P102=16,P102=21),K71,IF(OR(P102=14,P102=18,P102=22),M71,\"\")))))))))))","v":{"v":0.8786255339267028,"d":"0.8786"}},null,{"$f":"IF(P102=1,\"\",IF(P102=2,\"\",IF(P102=3,\"\",IF(P102=4,\"\",IF(P102=5,K61,IF(P102=6,K61+K62,IF(P102=7,K61,IF(P102=8,K61+K62,IF(P102=9,K62,IF(P102=10,\"\",IF(P102=11,\"\",IF(P102=12,K62,IF(P102=13,\"\",IF(P102=14,K62,IF(P102=15,K62,IF(P102=16,K62-K60,IF(P102=17,\"\",IF(P102=18,K62-K60,IF(P102=19,K62-K60,IF(P102=20,K62-K60,IF(P102=21,K62-(K60+K61),IF(P102=22,K62-(K60+K61),IF(P102=23,K62-(K60+K61),\"\")))))))))))))))))))))))","v":{"v":16,"d":"16.0"}}]
[{"$nulls":9},"Ściana IV",null,"→",null,"Ściana II"]
[]
[]
[{"$nulls":6},{"$f":"IF(F102=1,\"\",IF(F102=2,\"\",IF(F102=3,\"\",IF(F102=4,\"\",IF(F102=5,\"\",IF(F102=6,\"\",IF(F102=7,\"\",IF(F102=8,\"\",IF(F102=9,\"\",IF(F102=10,\"\",IF(AND(F102=11,K62=0),K61-K60,IF(AND(F102=11,K62>0,K62<K60,M70>=K69,M71<=K69),K61,IF(AND(F102=11,K62>0,K62<K60,M70<K69),K61+K62-K60,IF(AND(F102=11,K62>0,K62=K60),K61,IF(F102=12,\"\",IF(F102=13,\"\",IF(F102=14,K61,IF(F102=15,K61,IF(F102=16,\"\",IF(AND(F102=17,K70>M70),K62-K60,IF(AND(F102=17,M70>=K70),K61,IF(F102=18,K61,IF(F102=19,\"\",IF(F102=20,K61,IF(F102=21,K61,IF(F102=22,K61,IF(F102=23,K61,\"\")))))))))))))))))))))))))))","v":{"v":8,"d":"8.0"}},{"$f":"IF(OR(F102=11,F102=14,F102=15,F102=17,F102=18,F102=20,F102=21,F102=22,F102=23),M70,IF(F102=1,K69,IF(OR(F102=2,F102=4,F102=7,F102=8),M69,IF(OR(F102=3,F102=6,F102=12,F102=13,F102=19),L72,IF(OR(F102=5,F102=10),K70,IF(OR(F102=9,F102=16),K71,\"\"))))))","v":{"v":0.8236159352808572,"d":"0.8236"}},{"$nulls":6},{"$f":"IF(OR(P102=11,P102=14,P102=15,P102=17,P102=18,P102=20,P102=21,P102=22,P102=23),M70,IF(P102=1,K69,IF(OR(P102=2,P102=4,P102=7,P102=8),M69,IF(OR(P102=3,P102=6,P102=12,P102=13,P102=19),N72,IF(OR(P102=5,P102=10),K70,IF(OR(P102=9,P102=16),K71,\"\"))))))","v":{"v":0.8786255339267028,"d":"0.8786"}},null,{"$f":"IF(P102=1,\"\",IF(P102=2,\"\",IF(P102=3,\"\",IF(P102=4,\"\",IF(P102=5,\"\",IF(P102=6,\"\",IF(P102=7,\"\",IF(P102=8,\"\",IF(P102=9,\"\",IF(P102=10,\"\",IF(AND(P102=11,K62=0),K61-K60,IF(AND(P102=11,K62>0,K62<K60,M70>=K69,M71<=K69),K61,IF(AND(P102=11,K62>0,K62<K60,M70<K69),K61+K62-K60,IF(AND(P102=11,K62>0,K62=K60),K61,IF(P102=12,\"\",IF(P102=13,\"\",IF(P102=14,K61,IF(P102=15,K61,IF(P102=16,\"\",IF(AND(P102=17,K70>M70),K62-K60,IF(AND(P102=17,M70>=K70),K61,IF(P102=18,K61,IF(P102=19,\"\",IF(P102=20,K61,IF(P102=21,K61,IF(P102=22,K61,IF(P102=23,K61,\"\")))))))))))))))))))))))))))","v":""}]
[]
[]
[]
[{"$nulls":6},{"$f":"IF(F102=1,\"\",IF(F102=2,K60,IF(F102=3,\"\",IF(AND(F102=4,K69=M69,K60>=K61),\"\",IF(AND(F102=4,K69<>M69,K60=K61),K61,IF(AND(F102=4,K60>K61,K69>M69),K61,IF(AND(F102=4,K60>K61,K69<M69),K60,IF(F102=5,\"\",IF(F102=6,\"\",IF(F102=7,K60,IF(F102=8,K60,IF(F102=9,\"\",IF(AND(F102=10,K62=0),K60,IF(AND(F102=10,K62>0,K62<K60,K70>=M69,K71<=M69),K62,IF(AND(F102=10,K62>0,K62<K60,K70<M69),K60,IF(AND(F102=10,K62>0,K62=K60),K60,IF(F102=11,K60,IF(F102=12,\"\",IF(F102=13,K60,IF(F102=14,K60,IF(F102=15,K60,IF(F102=16,K60,IF(F102=17,K60,IF(F102=18,K60,IF(F102=19,K60,IF(F102=20,K60,IF(F102=21,K60,IF(F102=22,K60,IF(F102=23,K60,\"\")))))))))))))))))))))))))))))","v":{"v":2,"d":"2.0"}},{"$f":"IF(OR(F102=2,F102=4,F102=7,F102=8,F102=10,F102=11,F102=13,F102=14,F102=15,F102=16,F102=17,F102=18,F102=19,F102=20,F102=21,F102=22,F102=23),M69,IF(F102=1,K69,IF(OR(F102=3,F102=6,F102=12),L72,IF(F102=5,K70,IF(F102=9,K71,\"\")))))","v":{"v":1.0482384630847272,"d":"1.0482"}},{"$nulls":6},{"$f":"IF(OR(P102=2,P102=4,P102=7,P102=8,P102=10,P102=11,P102=13,P102=14,P102=15,P102=16,P102=17,P102=18,P102=19,P102=20,P102=21,P102=22,P102=23),M69,IF(P102=1,K69,IF(OR(P102=3,P102=6,P102=12),N72,IF(P102=5,K70,IF(P102=9,K71,\"\")))))","v":{"v":1.0482384630847272,"d":"1.0482"}},null,{"$f":"IF(P102=1,\"\",IF(P102=2,K60,IF(P102=3,\"\",IF(AND(P102=4,K69=M69,K60>=K61),\"\",IF(AND(P102=4,K69<>M69,K60=K61),K61,IF(AND(P102=4,K60>K61,K69>M69),K61,IF(AND(P102=4,K60>K61,K69<M69),K60,IF(P102=5,\"\",IF(P102=6,\"\",IF(P102=7,K60,IF(P102=8,K60,IF(P102=9,\"\",IF(AND(P102=10,K62=0),K60,IF(AND(P102=10,K62>0,K62<K60,K70>=M69,K71<=M69),K62,IF(AND(P102=10,K62>0,K62<K60,K70<M69),K60,IF(AND(P102=10,K62>0,K62=K60),K60,IF(P102=11,K60,IF(P102=12,\"\",IF(P102=13,K60,IF(P102=14,K60,IF(P102=15,K60,IF(P102=16,K60,IF(P102=17,K60,IF(P102=18,K60,IF(P102=19,K60,IF(P102=20,K60,IF(P102=21,K60,IF(P102=22,K60,IF(P102=23,K60,\"\")))))))))))))))))))))))))))))","v":{"v":2,"d":"2.0"}}]
[]
[]
[{"$nulls":11},"Ściana III"]
[{"$nulls":8},"kN/m2",{"$f":"IF(OR(U102=2,U102=4,U102=7,U102=8,U102=10,U102=11,U102=13,U102=14,U102=15,U102=16,U102=17,U102=18,U102=19,U102=20,U102=21,U102=22,U102=23),N69,IF(U102=1,L69,IF(OR(U102=3,U102=6,U102=12),K72,IF(U102=5,L70,IF(U102=9,L71,\"\")))))","v":{"v":2.1392621695606677,"d":"2.1393"}},{"$f":"IF(OR(U102=11,U102=14,U102=15,U102=17,U102=18,U102=20,U102=21,U102=22,U102=23),N70,IF(U102=1,L69,IF(OR(U102=2,U102=4,U102=7,U102=8),N69,IF(OR(U102=3,U102=6,U102=12,U102=13,U102=19),K72,IF(OR(U102=5,U102=10),L70,IF(OR(U102=9,U102=16),L71,\"\"))))))","v":{"v":2.1392621695606677,"d":"2.1393"}},{"$f":"IF(U102=1,L69,IF(AND(U102=4,L69>=N69),L69,IF(U102=2,N69,IF(AND(U102=4,N69>L69),N69,IF(OR(U102=3,U102=6,U102=8,U102=12,U102=13,U102=15,U102=19,U102=20,U102=23),K72,IF(OR(U102=5,U102=10),L70,IF(AND(U102=17,L70>N70),L70,IF(AND(U102=17,N70>=L70),N70,IF(OR(U102=7,U102=11),N70,IF(OR(U102=9,U102=16,U102=21),L71,IF(OR(U102=14,U102=18,U102=22),N71,\"\")))))))))))","v":{"v":1.6808488475119534,"d":"1.6808"}},{"$f":"IF(OR(U102=9,U102=10,U102=12,U102=16,U102=17,U102=19,U102=21,U102=22,U102=23),L70,IF(U102=2,N69,IF(OR(U102=3,U102=8,U102=13,U102=15,U102=20),K72,IF(OR(U102=1,U102=4,U102=5,U102=6),L69,IF(OR(U102=7,U102=11),N70,IF(OR(U102=14,U102=18),N71,\"\"))))))","v":{"v":1.6808488475119534,"d":"1.6808"}},{"$f":"IF(OR(U102=1,U102=4,U102=5,U102=6,U102=9,U102=10,U102=11,U102=12,U102=13,U102=16,U102=17,U102=18,U102=19,U102=20,U102=21,U102=22,U102=23),L69,IF(U102=2,N69,IF(OR(U102=3,U102=8,U102=15),K72,IF(U102=7,N70,IF(U102=14,N71,\"\")))))","v":{"v":1.6808488475119534,"d":"1.6808"}}]
[]
[]
[]
[]
[{"$nulls":8},"m",{"$f":"IF(U102=1,\"\",IF(U102=2,L60,IF(U102=3,\"\",IF(AND(U102=4,L69=N69,L60>=L61),\"\",IF(AND(U102=4,L69<>N69,L60=L61),L61,IF(AND(U102=4,L60>L61,L69>N69),L61,IF(AND(U102=4,L60>L61,L69<N69),L60,IF(U102=5,\"\",IF(U102=6,\"\",IF(U102=7,L60,IF(U102=8,L60,IF(U102=9,\"\",IF(AND(U102=10,L62=0),L60,IF(AND(U102=10,L62>0,L62<L60,L70>=N69,L71<=N69),L62,IF(AND(U102=10,L62>0,L62<L60,L70<N69),L60,IF(AND(U102=10,L62>0,L62=L60),L60,IF(U102=11,L60,IF(U102=12,\"\",IF(U102=13,L60,IF(U102=14,L60,IF(U102=15,L60,IF(U102=16,L60,IF(U102=17,L60,IF(U102=18,L60,IF(U102=19,L60,IF(U102=20,L60,IF(U102=21,L60,IF(U102=22,L60,IF(U102=23,L60,\"\")))))))))))))))))))))))))))))","v":5.6},{"$f":"IF(U102=1,\"\",IF(U102=2,\"\",IF(U102=3,\"\",IF(U102=4,\"\",IF(U102=5,\"\",IF(U102=6,\"\",IF(U102=7,\"\",IF(U102=8,\"\",IF(U102=9,\"\",IF(U102=10,\"\",IF(AND(U102=11,L62=0),L61-L60,IF(AND(U102=11,L62>0,L62<L60,N70>=L69,N71<=L69),L61,IF(AND(U102=11,L62>0,L62<L60,N70<L69),L61+L62-L60,IF(AND(U102=11,L62>0,L62=L60),L61,IF(U102=12,\"\",IF(U102=13,\"\",IF(U102=14,L61,IF(U102=15,L61,IF(U102=16,\"\",IF(AND(U102=17,L70>N70),L62-L60,IF(AND(U102=17,N70>=L70),L61,IF(U102=18,L61,IF(U102=19,\"\",IF(U102=20,L61,IF(U102=21,L61,IF(U102=22,L61,IF(U102=23,L61,\"\")))))))))))))))))))))))))))","v":""},{"$f":"IF(U102=1,\"\",IF(U102=2,\"\",IF(U102=3,\"\",IF(U102=4,\"\",IF(U102=5,L61,IF(U102=6,L61+L62,IF(U102=7,L61,IF(U102=8,L61+L62,IF(U102=9,L62,IF(U102=10,\"\",IF(U102=11,\"\",IF(U102=12,L62,IF(U102=13,\"\",IF(U102=14,L62,IF(U102=15,L62,IF(U102=16,L62-L60,IF(U102=17,\"\",IF(U102=18,L62-L60,IF(U102=19,L62-L60,IF(U102=20,L62-L60,IF(U102=21,L62-(L60+L61),IF(U102=22,L62-(L60+L61),IF(U102=23,L62-(L60+L61),\"\")))))))))))))))))))))))","v":4.4},{"$f":"IF(U102=1,\"\",IF(U102=2,\"\",IF(U102=3,\"\",IF(U102=4,\"\",IF(U102=5,\"\",IF(U102=6,\"\",IF(U102=7,\"\",IF(U102=8,\"\",IF(U102=9,L61,IF(AND(U102=10,L62=0),L61-L60,IF(AND(U102=10,L62>0,L62<L60,L70>=N69,L71<=N69),L61,IF(AND(U102=10,L62>0,L62<L60,L70<N69),L61+L62-L60,IF(AND(U102=10,L62>0,L62=L60),L61,IF(U102=11,\"\",IF(U102=12,L61,IF(U102=13,L61+L62-L60,IF(U102=14,\"\",IF(U102=15,\"\",IF(U102=16,L61,IF(AND(U102=17,L70>N70),L61,IF(AND(U102=17,N70>=L70),L62-L60,IF(U102=18,\"\",IF(U102=19,L61,IF(U102=20,\"\",IF(U102=21,L61,IF(U102=22,L61,IF(U102=23,L61,\"\")))))))))))))))))))))))))))","v":""},{"$f":"IF(U102=1,L60,IF(U102=2,\"\",IF(U102=3,L60+L61+L62,IF(AND(U102=4,L69=N69,L60>=L61),L60+L61,IF(AND(U102=4,L69<>N69,L60=L61),L60,IF(AND(U102=4,L60>L61,L69>N69),L60,IF(AND(U102=4,L60>L61,L69<N69),L61,IF(U102=5,L60,IF(U102=6,L60,IF(U102=7,\"\",IF(U102=8,\"\",IF(U102=9,L60,IF(U102=10,L60,IF(AND(U102=11,L62=0),L60,IF(AND(U102=11,L62>0,L62<L60,N70>=L69,N71<=L69),L62,IF(AND(U102=11,L62>0,L62<L60,N70<L69),L60,IF(AND(U102=11,L62>0,L62=L60),L60,IF(U102=12,L60,IF(U102=13,L60,IF(U102=14,\"\",IF(U102=15,\"\",IF(U102=16,L60,IF(U102=17,L60,IF(U102=18,L60,IF(U102=19,L60,IF(U102=20,L60,IF(U102=21,L60,IF(U102=22,L60,IF(U102=23,L60,\"\")))))))))))))))))))))))))))))","v":""}]
[]
[]
[]
[{"$nulls":9},{"$f":"TEXT(N60+N61+N62,\"####0,0##\")&\" m\"","v":"10,0 m"}]
[]
[]
[{"$nulls":9},{"$f":"\"Wysokość  ze = \"&TEXT('Obliczenia wiatr II'!E42,\"####0,0##\")&\" m\"","v":"Wysokość  ze = 25,0 m"}]
[]
[]
[]
[]
[{"$nulls":9},"Tablica szerokości pól ściany"]
[]
[{"$nulls":10},"Ściana IV","Ściana I","Ściana II","Ściana III"]
[{"$nulls":9},"a",{"$f":"'Obliczenia wiatr II'!D35","v":2},{"$f":"'Obliczenia wiatr II'!E35","v":5.6},{"$f":"'Obliczenia wiatr II'!F35","v":2},{"$f":"'Obliczenia wiatr II'!G35","v":5.6}]
[{"$nulls":9},"b",{"$f":"'Obliczenia wiatr II'!D36","v":8},{"$f":"'Obliczenia wiatr II'!E36","v":4.4},{"$f":"'Obliczenia wiatr II'!F36","v":8},{"$f":"'Obliczenia wiatr II'!G36","v":4.4}]
[{"$nulls":9},"c",{"$f":"'Obliczenia wiatr II'!D37","v":{"v":18,"d":"18.0"}},{"$f":"'Obliczenia wiatr II'!E37","v":{"v":0,"d":"0.0"}},{"$f":"'Obliczenia wiatr II'!F37","v":{"v":18,"d":"18.0"}},{"$f":"'Obliczenia wiatr II'!G37","v":{"v":0,"d":"0.0"}}]
[]
[{"$nulls":9},"e (prost)",{"$f":"'Obliczenia wiatr II'!D29","v":{"v":10,"d":"10.0"}},{"$f":"'Obliczenia wiatr II'!E29","v":{"v":28,"d":"28.0"}},{"$f":"'Obliczenia wiatr II'!F29","v":{"v":10,"d":"10.0"}},{"$f":"'Obliczenia wiatr II'!G29","v":{"v":28,"d":"28.0"}}]
[]
[{"$nulls":9},"Tablica obciążenia wiatrem"]
[]
[{"$nulls":10},"Wiatr 1","Wiatr 2","Wiatr 3","Wiatr 4"]
[{"$nulls":9},"A",{"$f":"'Obliczenia wiatr II'!D93","v":{"v":2.1392621695606677,"d":"2.1393"}},{"$f":"'Obliczenia wiatr II'!E93","v":{"v":1.0482384630847272,"d":"1.0482"}},{"$f":"'Obliczenia wiatr II'!F93","v":{"v":1.0482384630847272,"d":"1.0482"}},{"$f":"'Obliczenia wiatr II'!G93","v":{"v":2.1392621695606677,"d":"2.1393"}}]
[{"$nulls":9},"B",{"$f":"'Obliczenia wiatr II'!D94","v":{"v":1.6808488475119534,"d":"1.6808"}},{"$f":"'Obliczenia wiatr II'!E94","v":{"v":0.8236159352808572,"d":"0.8236"}},{"$f":"'Obliczenia wiatr II'!F94","v":{"v":0.8236159352808572,"d":"0.8236"}},{"$f":"'Obliczenia wiatr II'!G94","v":{"v":1.6808488475119534,"d":"1.6808"}}]
[{"$nulls":9},"C",{"$f":"'Obliczenia wiatr II'!D95","v":{"v":0.7640222034145243,"d":"0.7640"}},{"$f":"'Obliczenia wiatr II'!E95","v":{"v":0,"d":"0.0000"}},{"$f":"'Obliczenia wiatr II'!F95","v":{"v":0.3743708796731169,"d":"0.3744"}},{"$f":"'Obliczenia wiatr II'!G95","v":{"v":0,"d":"0.0000"}}]
[{"$nulls":9},"E",{"$f":"'Obliczenia wiatr II'!D96","v":{"v":0.7203637917902914,"d":"0.7204"}},{"$f":"'Obliczenia wiatr II'!E96","v":{"v":0.4305265116240844,"d":"0.4305"}},{"$f":"'Obliczenia wiatr II'!F96","v":{"v":0.3529782579772428,"d":"0.3530"}},{"$f":"'Obliczenia wiatr II'!G96","v":{"v":0.8786255339267028,"d":"0.8786"}}]
[]
[null,null,"Układy pól obciążenia na ścianach"]
[]
[null,null,"ŚCIANA IV",{"$nulls":4},"ŚCIANA I",{"$nulls":4},"ŚCIANA II",{"$nulls":4},"ŚCIANA III"]
[]
[null,null,1,"A1",null,{"$f":"IF(AND(K60>0,K61=0,K62=0,K69>=M69,L72<=K69),1,0)","v":0},null,1,"A2",null,{"$f":"IF(AND(L60>0,L61=0,L62=0,L69>=N69,M72<=L69),1,0)","v":0},null,1,"A1",null,{"$f":"IF(AND(K60>0,K61=0,K62=0,K69>=M69,N72<=K69),1,0)","v":0},null,1,"A2",null,{"$f":"IF(AND(L60>0,L61=0,L62=0,L69>=N69,K72<=L69),1,0)","v":0}]
[null,null,2,"A3",null,{"$f":"IF(AND(K60>0,K61=0,K62=0,M69>K69,L72<=M69),2,0)","v":0},null,2,"A4",null,{"$f":"IF(AND(L60>0,L61=0,L62=0,N69>L69,M72<=N69),2,0)","v":0},null,2,"A3",null,{"$f":"IF(AND(K60>0,K61=0,K62=0,M69>K69,N72<=M69),2,0)","v":0},null,2,"A4",null,{"$f":"IF(AND(L60>0,L61=0,L62=0,N69>L69,K72<=N69),2,0)","v":0}]
[null,null,3,"E2",null,{"$f":"IF(AND(K60>0,K61>=0,K62>=0,L72>K69,L72>M69),3,0)","v":0},null,3,"E3",null,{"$f":"IF(AND(L60>0,L61>=0,L62>=0,M72>L69,M72>N69),3,0)","v":0},null,3,"E4",null,{"$f":"IF(AND(K60>0,K61>=0,K62>=0,L72>K69,N72>M69),3,0)","v":0},null,3,"E1",null,{"$f":"IF(AND(L60>0,L61>=0,L62>=0,K72>L69,K72>N69),3,0)","v":0}]
[null,null,4,"A1-A3",null,{"$f":"IF(AND(K60>0,K61>0,K62=0,K60>=K61,K69>=M70,M69>=K70,L72<=K69,L72<=M69),4,0)","v":0},null,4,"A2-A4",null,{"$f":"IF(AND(L60>0,L61>0,L62=0,L60>=L61,L69>=N70,N69>=L70,M72<=L69,M72<=N69),4,0)","v":0},null,4,"A1-A3",null,{"$f":"IF(AND(K60>0,K61>0,K62=0,K60>=K61,K69>=M70,M69>=K70,N72<=K69,N72<=M69),4,0)","v":0},null,4,"A2-A4",null,{"$f":"IF(AND(L60>0,L61>0,L62=0,L60>=L61,L69>=N70,N69>=L70,K72<=L69,K72<=N69),4,0)","v":0}]
[null,null,5,"A1-B1",null,{"$f":"IF(AND(K60>0,K61>0,K62=0,K70>=M69,L72<=K70),5,0)","v":0},null,5,"A2-B2",null,{"$f":"IF(AND(L60>0,L61>0,L62=0,L70>=N69,M72<=L70),5,0)","v":0},null,5,"A1-B1",null,{"$f":"IF(AND(K60>0,K61>0,K62=0,K70>=M69,N72<=K70),5,0)","v":0},null,5,"A2-B2",null,{"$f":"IF(AND(L60>0,L61>0,L62=0,L70>=N69,K72<=L70),5,0)","v":0}]
[null,null,6,"A1-E2",null,{"$f":"IF(AND(K60>0,K61>0,K62>=0,L72<K69,L72>K70,L72>M69),6,0)","v":0},null,6,"A2-E3",null,{"$f":"IF(AND(L60>0,L61>0,L62=0,M72<L69,M72>L70,M72>N69),6,0)","v":0},null,6,"A1-E4",null,{"$f":"IF(AND(K60>0,K61>0,K62>=0,N72<K69,N72>K70,N72>M69),6,0)","v":0},null,6,"A2-E1",null,{"$f":"IF(AND(L60>0,L61>0,L62=0,K72<L69,K72>L70,K72>N69),6,0)","v":0}]
[null,null,7,"B3-A3",null,{"$f":"IF(AND(K60>0,K61>0,K62=0,M70>=K69,L72<=M70),7,0)","v":0},null,7,"B4-A4",null,{"$f":"IF(AND(L60>0,L61>0,L62=0,N70>=L69,M72<=N70),7,0)","v":7},null,7,"B3-A3",null,{"$f":"IF(AND(K60>0,K61>0,K62=0,M70>=K69,N72<=M70),7,0)","v":0},null,7,"B4-A4",null,{"$f":"IF(AND(L60>0,L61>0,L62=0,N70>=L69,K72<=N70),7,0)","v":7}]
[null,null,8,"E2-A3",null,{"$f":"IF(AND(K60>0,K61>0,K62>=0,L72<M69,L72>M70,L72>K69),8,0)","v":0},null,8,"E3-A4",null,{"$f":"IF(AND(L60>0,L61>0,L62>=0,M72<N69,M72>N70,M72>L69),8,0)","v":0},null,8,"E4-A3",null,{"$f":"IF(AND(K60>0,K61>0,K62>=0,N72<M69,N72>M70,N72>K69),8,0)","v":0},null,8,"E1-A4",null,{"$f":"IF(AND(L60>0,L61>0,L62>=0,K72<N69,K72>N70,K72>L69),8,0)","v":0}]
[null,null,9,"A1-B1-C1",null,{"$f":"IF(AND(K60>0,K61>0,K62>0,K71>=M69,L72<=K71),9,0)","v":0},null,9,"A2-B2-C2",null,{"$f":"IF(AND(L60>0,L61>0,L62>0,L71>=N69,M72<=L71),9,0)","v":0},null,9,"A1-B1-C1",null,{"$f":"IF(AND(K60>0,K61>0,K62>0,K71>=M69,N72<=K71),9,0)","v":0},null,9,"A2-B2-C2",null,{"$f":"IF(AND(L60>0,L61>0,L62>0,L71>=N69,K72<=L71),9,0)","v":0}]
[null,null,10,"A1-B1-A3",null,{"$f":"IF(AND(K60>0,K61>0,K62>=0,K62<=K60,K60<K61,K70>=M70,IF(K62=0,M69>K70,M69>K71),L72<=K70,L72<=M69),10,0)","v":0},null,10,"A2-B2-A4",null,{"$f":"IF(AND(L60>0,L61>0,L62>=0,L62<=L60,L60<L61,L70>=N70,IF(L62=0,N69>L70,N69>L71),M72<=L70,M72<=N69),10,0)","v":0},null,10,"A1-B1-A3",null,{"$f":"IF(AND(K60>0,K61>0,K62>=0,K62<=K60,K60<K61,K70>=M70,IF(K62=0,M69>K70,M69>K71),N72<=K70,N72<=M69),10,0)","v":0},null,10,"A2-B2-A4",null,{"$f":"IF(AND(L60>0,L61>0,L62>=0,L62<=L60,L60<L61,L70>=N70,IF(L62=0,N69>L70,N69>L71),K72<=L70,K72<=N69),10,0)","v":0}]
[null,null,11,"A1-B3-A3",null,{"$f":"IF(AND(K60>0,K61>0,K62>=0,K62<=K60,K60<K61,M70>K70,IF(K62=0,K69>M70,K69>M71),L72<=M70,L72<=K69),11,0)","v":0},null,11,"A2-B4-A4",null,{"$f":"IF(AND(L60>0,L61>0,L62>=0,L62<=L60,L60<L61,N70>L70,IF(L62=0,L69>N70,L69>N71),M72<=N70,M72<=L69),11,0)","v":0},null,11,"A1-B3-A3",null,{"$f":"IF(AND(K60>0,K61>0,K62>=0,K62<=K60,K60<K61,M70>K70,IF(K62=0,K69>M70,K69>M71),N72<=M70,N72<=K69),11,0)","v":0},null,11,"A2-B4-A4",null,{"$f":"IF(AND(L60>0,L61>0,L62>=0,L62<=L60,L60<L61,N70>L70,IF(L62=0,L69>N70,L69>N71),K72<=N70,K72<=L69),11,0)","v":0}]
[null,null,12,"A1-B1-E2",null,{"$f":"IF(AND(K60>0,K61>0,K62>0,L72<K70,L72>M69,L72>K71),12,0)","v":0},null,12,"A2-B2-E3",null,{"$f":"IF(AND(L60>0,L61>0,L62>0,M72<L70,M72>N69,M72>L71),12,0)","v":0},null,12,"A1-B1-E4",null,{"$f":"IF(AND(K60>0,K61>0,K62>0,L72<K70,N72>M69,N72>K71),12,0)","v":0},null,12,"A2-B2-E1",null,{"$f":"IF(AND(L60>0,L61>0,L62>0,K72<L70,K72>N69,K72>L71),12,0)","v":0}]
[null,null,13,"A1-E2-A3",null,{"$f":"IF(AND(K60>0,K60<K61,K62>=0,L72<K69,L72<M69,L72>K70,L72>M70),13,0)","v":0},null,13,"A2-E3-A4",null,{"$f":"IF(AND(L60>0,L60<L61,L62>=0,M72<L69,M72<N69,M72>L70,M72>N70),13,0)","v":0},null,13,"A1-E4-A3",null,{"$f":"IF(AND(K60>0,K60<K61,K62>=0,N72<K69,N72<M69,N72>K70,N72>M70),13,0)","v":0},null,13,"A2-E1-A4",null,{"$f":"IF(AND(L60>0,L60<L61,L62>=0,K72<L69,K72<N69,K72>L70,K72>N70),13,0)","v":0}]
[null,null,14,"C3-B3-A3",null,{"$f":"IF(AND(K60>0,K61>0,K62>0,M71>=K69,L72<=M71),14,0)","v":0},null,14,"C4-B4-A4",null,{"$f":"IF(AND(L60>0,L61>0,L62>0,N71>=L69,M72<=N71),14,0)","v":0},null,14,"C3-B3-A3",null,{"$f":"IF(AND(K60>0,K61>0,K62>0,M71>=K69,N72<=M71),14,0)","v":0},null,14,"C4-B4-A4",null,{"$f":"IF(AND(L60>0,L61>0,L62>0,N71>=L69,K72<=N71),14,0)","v":0}]
[null,null,15,"E2-B3-A3",null,{"$f":"IF(AND(K60>0,K61>0,K62>0,L72<M70,L72>K69,L72>M71),15,0)","v":0},null,15,"E3-B4-A4",null,{"$f":"IF(AND(L60>0,L61>0,L62>0,M72<N70,M72>L69,M72>N71),15,0)","v":0},null,15,"E4-B3-A3",null,{"$f":"IF(AND(K60>0,K61>0,K62>0,N72<M70,N72>K69,N72>M71),15,0)","v":0},null,15,"E1-B4-A4",null,{"$f":"IF(AND(L60>0,L61>0,L62>0,K72<N70,K72>L69,K72>N71),15,0)","v":0}]
[null,null,16,"A1-B1-C1-A3",null,{"$f":"IF(AND(K60>0,K61>0,K62>0,K62>K60,K71>=M70,K71<M69,L72<=K71),16,0)","v":0},null,16,"A2-B2-C2-A4",null,{"$f":"IF(AND(L60>0,L61>0,L62>0,L62>L60,L71>=N70,L71<N69,M72<=L71),16,0)","v":0},null,16,"A1-B1-C1-A3",null,{"$f":"IF(AND(K60>0,K61>0,K62>0,K62>K60,K71>=M70,K71<M69,N72<=K71),16,0)","v":0},null,16,"A2-B2-C2-A4",null,{"$f":"IF(AND(L60>0,L61>0,L62>0,L62>L60,L71>=N70,L71<N69,K72<=L71),16,0)","v":0}]
[null,null,17,"A1-B1-B3-A3",null,{"$f":"IF(AND(K60>0,K61>0,K62>0,K62>K60,K62<=K60+K61,K71<M70,M71<K70,L72<=M70,L72<=K70),17,0)","v":0},null,17,"A2-B2-B4-A4",null,{"$f":"IF(AND(L60>0,L61>0,L62>0,L62>L60,L62<=L60+L61,L71<N70,N71<L70,M72<=N70,M72<=L70),17,0)","v":0},null,17,"A1-B1-B3-A3",null,{"$f":"IF(AND(K60>0,K61>0,K62>0,K62>K60,K62<=K60+K61,K71<M70,M71<K70,N72<=M70,N72<=K70),17,0)","v":0},null,17,"A2-B2-B4-A4",null,{"$f":"IF(AND(L60>0,L61>0,L62>0,L62>L60,L62<=L60+L61,L71<N70,N71<L70,K72<=N70,K72<=L70),17,0)","v":0}]
[null,null,18,"A1-C3-B3-A3",null,{"$f":"IF(AND(K60>0,K61>0,K62>0,K62>K60,M71>=K70,M71<K69,L72<=M71),18,0)","v":0},null,18,"A2-C4-B4-A4",null,{"$f":"IF(AND(L60>0,L61>0,L62>0,L62>L60,N71>=L70,N71<L69,M72<=N71),18,0)","v":0},null,18,"A1-C3-B3-A3",null,{"$f":"IF(AND(K60>0,K61>0,K62>0,K62>K60,M71>=K70,M71<K69,N72<=M71),18,0)","v":0},null,18,"A2-C4-B4-A4",null,{"$f":"IF(AND(L60>0,L61>0,L62>0,L62>L60,N71>=L70,N71<L69,K72<=N71),18,0)","v":0}]
[null,null,19,"A1-B1-E2-A3",null,{"$f":"IF(AND(K60>0,K61>0,K62>0,K62>K60,L72<M69,L72>K71,L72>M70,L72<K70),19,0)","v":0},null,19,"A2-B2-E3-A4",null,{"$f":"IF(AND(L60>0,L61>0,L62>0,L62>L60,M72<N69,M72>L71,M72>N70,M72<L70),19,0)","v":0},null,19,"A1-B1-E4-A3",null,{"$f":"IF(AND(K60>0,K61>0,K62>0,K62>K60,N72<M69,N72>K71,N72>M70,N72<K70),19,0)","v":19},null,19,"A2-B2-E1-A4",null,{"$f":"IF(AND(L60>0,L61>0,L62>0,L62>L60,K72<N69,K72>L71,K72>N70,K72<L70),19,0)","v":0}]
[null,null,20,"A1-E2-B3-A3",null,{"$f":"IF(AND(K60>0,K61>0,K62>0,K62>K60,L72<K69,L72>M71,L72>K70,L72<M70),20,0)","v":0},null,20,"A2-E3-B4-A4",null,{"$f":"IF(AND(L60>0,L61>0,L62>0,L62>L60,M72<L69,M72>N71,M72>L70,M72<N70),20,0)","v":0},null,20,"A1-E4-B3-A3",null,{"$f":"IF(AND(K60>0,K61>0,K62>0,K62>K60,N72<K69,N72>M71,N72>K70,N72<M70),20,0)","v":0},null,20,"A2-E1-B4-A4",null,{"$f":"IF(AND(L60>0,L61>0,L62>0,L62>L60,K72<L69,K72>N71,K72>L70,K72<N70),20,0)","v":0}]
[null,null,21,"A1-B1-C1-B3-A3",null,{"$f":"IF(AND(K60>0,K61>0,K62>0,K62>K60+K61,M71<K70,K71<M70,K71>=M71,L72<=K71),21,0)","v":21},null,21,"A2-B2-C2-B4-A4",null,{"$f":"IF(AND(L60>0,L61>0,L62>0,L62>L60+L61,N71<L70,L71<N70,L71>=N71,M72<=L71),21,0)","v":0},null,21,"A1-B1-C1-B3-A3",null,{"$f":"IF(AND(K60>0,K61>0,K62>0,K62>K60+K61,M71<K70,K71<M70,K71>=M71,N72<=K71),21,0)","v":0},null,21,"A2-B2-C2-B4-A4",null,{"$f":"IF(AND(L60>0,L61>0,L62>0,L62>L60+L61,N71<L70,L71<N70,L71>=N71,K72<=L71),21,0)","v":0}]
[null,null,22,"A1-B1-C3-B3-A3",null,{"$f":"IF(AND(K60>0,K61>0,K62>0,K62>K60+K61,M71<K70,K71<M70,K71<M71,L72<=M71),22,0)","v":0},null,22,"A2-B2-C4-B4-A4",null,{"$f":"IF(AND(L60>0,L61>0,L62>0,L62>L60+L61,N71<L70,L71<N70,L71<N71,M72<=N71),22,0)","v":0},null,22,"A1-B1-C3-B3-A3",null,{"$f":"IF(AND(K60>0,K61>0,K62>0,K62>K60+K61,M71<K70,K71<M70,K71<M71,N72<=M71),22,0)","v":0},null,22,"A2-B2-C4-B4-A4",null,{"$f":"IF(AND(L60>0,L61>0,L62>0,L62>L60+L61,N71<L70,L71<N70,L71<N71,K72<=N71),22,0)","v":0}]
[null,null,23,"A1-B1-E2-B3-A3",null,{"$f":"IF(AND(K60>0,K61>0,K62>0,K62>K60+K61,L72<K70,L72<M70,L72>K71,L72>M71),23,0)","v":0},null,23,"A2-B2-E3-B4-A4",null,{"$f":"IF(AND(L60>0,L61>0,L62>0,L62>L60+L61,M72<L70,M72<N70,M72>L71,M72>N71),23,0)","v":0},null,23,"A1-B1-E4-B3-A3",null,{"$f":"IF(AND(K60>0,K61>0,K62>0,K62>K60+K61,N72<K70,N72<M70,N72>K71,N72>M71),23,0)","v":0},null,23,"A2-B2-E1-B4-A4",null,{"$f":"IF(AND(L60>0,L61>0,L62>0,L62>L60+L61,K72<L70,K72<N70,K72>L71,K72>N71),23,0)","v":0}]
[]
[null,null,"Występujący przypadek",null,null,{"$f":"MAX(F78:F100)","v":21},null,"Występujący przypadek",null,null,{"$f":"MAX(K78:K100)","v":7},null,"Występujący przypadek",null,null,{"$f":"MAX(P78:P100)","v":19},null,"Występujący przypadek",null,null,{"$f":"MAX(U78:U100)","v":7}]
[]
[null,null,"UWAGA! Na każdej ścianie nie może jednocześnie wystąpić więcej niż jeden przypadek układu pól obciążenia. Zaleca się sprawdzenie, czy w poszczególnych kolumnach występuje tylko jedna wartość różna od zera. Występowanie kilku wartości różnych od zera, będzie świadczyć o błędzie w programie. W takiej sytuacji zaleca się nieznaczną zmianę wymiarów budynku."]

{"sheet":"Łączniki wiatr I","index":9,"n_rows":107,"n_cols":21,"rows_kept":107,"merged":[[1,1,2,21],[3,1,3,21],[5,1,5,21],[7,8,7,13],[8,8,8,13],[9,8,9,13],[11,9,13,13],[14,8,17,8],[14,9,17,9],[14,10,17,10],[14,11,17,11],[14,12,17,12],[14,13,17,13],[18,8,19,8],[18,9,19,9],[18,10,19,10],[18,11,19,11],[18,12,19,12],[18,13,19,13],[18,14,19,14],[20,8,22,8],[20,9,22,9],[20,10,22,10],[20,11,22,11],[20,12,22,12],[20,13,22,13],[20,14,22,14],[23,4,42,4],[23,5,42,5],[23,6,26,6],[23,7,26,7],[23,8,26,8],[23,14,26,14],[23,15,26,15],[23,16,26,16],[23,17,42,17],[24,9,25,9],[24,10,41,10],[27,6,30,6],[27,7,30,7],[27,8,30,8],[27,14,30,14],[27,15,30,15],[27,16,30,16],[28,9,29,9],[31,6,34,6],[31,7,34,7],[31,8,34,8],[31,14,34,14],[31,15,34,15],[31,16,34,16],[32,9,33,9],[32,11,33,11],[32,13,33,13],[35,6,38,6],[35,7,38,7],[35,8,38,8],[35,14,38,14],[35,15,38,15],[35,16,38,16],[36,9,37,9],[39,6,42,6],[39,7,42,7],[39,8,42,8],[39,14,42,14],[39,15,42,15],[39,16,42,16],[40,9,41,9],[43,8,45,8],[43,9,45,9],[43,10,45,10],[43,11,45,11],[43,12,45,12],[43,13,45,13],[46,8,47,8],[46,9,47,9],[46,10,47,10],[46,11,47,11],[46,12,47,12],[46,13,47,13],[48,8,51,8],[48,9,51,9],[48,10,51,10],[48,11,51,11],[48,12,51,12],[48,13,51,13],[52,9,54,13],[55,9,57,13],[60,9,60,13],[71,9,71,13],[80,1,80,6],[80,8,80,13],[80,15,80,20]]}
[]
[null,"Określenie liczby łączników mechanicznych ze względu na nośność, przy oddziaływaniu wiatru I "]
[]
[null,"Wiatr I -takie same warunki ze wszystkich kierunków"]
[]
[null,"UWAGA! Wymiary rzutu budynku i szerokości pól ściany nie są pokazywane w skali."]
[]
[{"$nulls":8},"Układ łączników",{"$nulls":5},"T"]
[{"$nulls":8},"Minimalna liczba łączników, szt./m²",{"$nulls":5},{"v":5,"d":"5.0"}]
[{"$nulls":8},"Dopuszczalne niedoszacowanie nośności, %",{"$nulls":5},{"v":3,"d":"3.0"}]
[]
[{"$nulls":9},{"$f":"\"Wysokość  ze = \"&TEXT('Obliczenia wiatr I'!D46,\"####0,0##\")&\" m\"","v":"Wysokość  ze = 25,0 m"}]
[]
[]
[{"$nulls":8},"m",{"$f":"'Wyniki graficzne wiatr I'!J11","v":""},{"$f":"'Wyniki graficzne wiatr I'!K11","v":""},{"$f":"'Wyniki graficzne wiatr I'!L11","v":""},{"$f":"'Wyniki graficzne wiatr I'!M11","v":""},{"$f":"'Wyniki graficzne wiatr I'!N11","v":{"v":10,"d":"10.0"}}]
[]
[]
[]
[{"$nulls":8},"Schemat",{"$f":"IF(O8=\"T\",INDEX(F84:F100,MATCH(TRUE,E84:E100>=J63,0)),IF(O8=\"W\",INDEX(M84:M100,MATCH(TRUE,L84:L100>=J63,0)),IF(O8=\"H\",INDEX(T84:T103,MATCH(TRUE,S84:S103>=J63,0)),0)))","v":5},{"$f":"IF(O8=\"T\",INDEX(F84:F100,MATCH(TRUE,E84:E100>=K63,0)),IF(O8=\"W\",INDEX(M84:M100,MATCH(TRUE,L84:L100>=K63,0)),IF(O8=\"H\",INDEX(T84:T103,MATCH(TRUE,S84:S103>=K63,0)),0)))","v":5},{"$f":"IF(O8=\"T\",INDEX(F84:F100,MATCH(TRUE,E84:E100>=L63,0)),IF(O8=\"W\",INDEX(M84:M100,MATCH(TRUE,L84:L100>=L63,0)),IF(O8=\"H\",INDEX(T84:T103,MATCH(TRUE,S84:S103>=L63,0)),0)))","v":5},{"$f":"IF(O8=\"T\",INDEX(F84:F100,MATCH(TRUE,E84:E100>=M63,0)),IF(O8=\"W\",INDEX(M84:M100,MATCH(TRUE,L84:L100>=M63,0)),IF(O8=\"H\",INDEX(T84:T103,MATCH(TRUE,S84:S103>=M63,0)),0)))","v":5},{"$f":"IF(O8=\"T\",INDEX(F84:F100,MATCH(TRUE,E84:E100>=N63,0)),IF(O8=\"W\",INDEX(M84:M100,MATCH(TRUE,L84:L100>=N63,0)),IF(O8=\"H\",INDEX(T84:T103,MATCH(TRUE,S84:S103>=N63,0)),0)))","v":5},"Schemat"]
[]
[{"$nulls":8},"Łączniki szt./m²",{"$f":"IF(O8=\"T\",INDEX(G84:G100,MATCH(TRUE,E84:E100>=J63,0)),IF(O8=\"W\",INDEX(N84:N100,MATCH(TRUE,L84:L100>=J63,0)),IF(O8=\"H\",INDEX(U84:U103,MATCH(TRUE,S84:S103>=J63,0)),0)))","v":{"v":8,"d":"8.0"}},{"$f":"IF(O8=\"T\",INDEX(G84:G100,MATCH(TRUE,E84:E100>=K63,0)),IF(O8=\"W\",INDEX(N84:N100,MATCH(TRUE,L84:L100>=K63,0)),IF(O8=\"H\",INDEX(U84:U103,MATCH(TRUE,S84:S103>=K63,0)),0)))","v":{"v":8,"d":"8.0"}},{"$f":"IF(O8=\"T\",INDEX(G84:G100,MATCH(TRUE,E84:E100>=L63,0)),IF(O8=\"W\",INDEX(N84:N100,MATCH(TRUE,L84:L100>=L63,0)),IF(O8=\"H\",INDEX(U84:U103,MATCH(TRUE,S84:S103>=L63,0)),0)))","v":{"v":8,"d":"8.0"}},{"$f":"IF(O8=\"T\",INDEX(G84:G100,MATCH(TRUE,E84:E100>=M63,0)),IF(O8=\"W\",INDEX(N84:N100,MATCH(TRUE,L84:L100>=M63,0)),IF(O8=\"H\",INDEX(U84:U103,MATCH(TRUE,S84:S103>=M63,0)),0)))","v":{"v":8,"d":"8.0"}},{"$f":"IF(O8=\"T\",INDEX(G84:G100,MATCH(TRUE,E84:E100>=N63,0)),IF(O8=\"W\",INDEX(N84:N100,MATCH(TRUE,L84:L100>=N63,0)),IF(O8=\"H\",INDEX(U84:U103,MATCH(TRUE,S84:S103>=N63,0)),0)))","v":{"v":8,"d":"8.0"}},"Łączniki szt./m²"]
[]
[{"$nulls":6},"m","Schemat",{"$nulls":7},"Schemat","m"]
[{"$nulls":4},{"$f":"\"Wysokość  ze = \"&TEXT('Obliczenia wiatr I'!C46,\"####0,0##\")&\" m\"","v":"Wysokość  ze = 25,0 m"},{"$f":"TEXT(K75+K76+K77,\"####0,0##\")&\" m\"","v":"28,0 m"},{"$f":"'Wyniki graficzne wiatr I'!G20","v":{"v":2,"d":"2.0"}},{"$f":"IF(O8=\"T\",INDEX(F84:F100,MATCH(TRUE,E84:E100>=I64,0)),IF(O8=\"W\",INDEX(M84:M100,MATCH(TRUE,L84:L100>=I64,0)),IF(O8=\"H\",INDEX(T84:T103,MATCH(TRUE,S84:S103>=I64,0)),0)))","v":5},{"$f":"IF(O8=\"T\",INDEX(G84:G100,MATCH(TRUE,E84:E100>=I64,0)),IF(O8=\"W\",INDEX(N84:N100,MATCH(TRUE,L84:L100>=I64,0)),IF(O8=\"H\",INDEX(U84:U103,MATCH(TRUE,S84:S103>=I64,0)),0)))","v":{"v":8,"d":"8.0"}},null,null,"Ściana I",null,null,{"$f":"IF(O8=\"T\",INDEX(G84:G100,MATCH(TRUE,E84:E100>=O64,0)),IF(O8=\"W\",INDEX(N84:N100,MATCH(TRUE,L84:L100>=O64,0)),IF(O8=\"H\",INDEX(U84:U103,MATCH(TRUE,S84:S103>=O64,0)),0)))","v":{"v":8,"d":"8.0"}},{"$f":"IF(O8=\"T\",INDEX(F84:F100,MATCH(TRUE,E84:E100>=O64,0)),IF(O8=\"W\",INDEX(M84:M100,MATCH(TRUE,L84:L100>=O64,0)),IF(O8=\"H\",INDEX(T84:T103,MATCH(TRUE,S84:S103>=O64,0)),0)))","v":5},{"$f":"'Wyniki graficzne wiatr I'!Q20","v":{"v":2,"d":"2.0"}},{"$f":"\"Wysokość  ze = \"&TEXT('Obliczenia wiatr I'!C46,\"####0,0##\")&\" m\"","v":"Wysokość  ze = 25,0 m"}]
[]
[]
[]
[{"$nulls":6},{"$f":"'Wyniki graficzne wiatr I'!G24","v":{"v":8,"d":"8.0"}},{"$f":"IF(O8=\"T\",INDEX(F84:F100,MATCH(TRUE,E84:E100>=I65,0)),IF(O8=\"W\",INDEX(M84:M100,MATCH(TRUE,L84:L100>=I65,0)),IF(O8=\"H\",INDEX(T84:T103,MATCH(TRUE,S84:S103>=I65,0)),0)))","v":3},{"$f":"IF(O8=\"T\",INDEX(G84:G100,MATCH(TRUE,E84:E100>=I65,0)),IF(O8=\"W\",INDEX(N84:N100,MATCH(TRUE,L84:L100>=I65,0)),IF(O8=\"H\",INDEX(U84:U103,MATCH(TRUE,S84:S103>=I65,0)),0)))","v":{"v":6,"d":"6.0"}},{"$nulls":5},{"$f":"IF(O8=\"T\",INDEX(G84:G100,MATCH(TRUE,E84:E100>=O65,0)),IF(O8=\"W\",INDEX(N84:N100,MATCH(TRUE,L84:L100>=O65,0)),IF(O8=\"H\",INDEX(U84:U103,MATCH(TRUE,S84:S103>=O65,0)),0)))","v":{"v":6,"d":"6.0"}},{"$f":"IF(O8=\"T\",INDEX(F84:F100,MATCH(TRUE,E84:E100>=O65,0)),IF(O8=\"W\",INDEX(M84:M100,MATCH(TRUE,L84:L100>=O65,0)),IF(O8=\"H\",INDEX(T84:T103,MATCH(TRUE,S84:S103>=O65,0)),0)))","v":3},{"$f":"'Wyniki graficzne wiatr I'!Q24","v":{"v":8,"d":"8.0"}}]
[]
[]
[]
[{"$nulls":6},{"$f":"'Wyniki graficzne wiatr I'!G28","v":{"v":8,"d":"8.0"}},{"$f":"IF(O8=\"T\",INDEX(F84:F100,MATCH(TRUE,E84:E100>=I66,0)),IF(O8=\"W\",INDEX(M84:M100,MATCH(TRUE,L84:L100>=I66,0)),IF(O8=\"H\",INDEX(T84:T103,MATCH(TRUE,S84:S103>=I66,0)),0)))","v":2},{"$f":"IF(O8=\"T\",INDEX(G84:G100,MATCH(TRUE,E84:E100>=I66,0)),IF(O8=\"W\",INDEX(N84:N100,MATCH(TRUE,L84:L100>=I66,0)),IF(O8=\"H\",INDEX(U84:U103,MATCH(TRUE,S84:S103>=I66,0)),0)))","v":{"v":5,"d":"5.0"}},{"$nulls":5},{"$f":"IF(O8=\"T\",INDEX(G84:G100,MATCH(TRUE,E84:E100>=O66,0)),IF(O8=\"W\",INDEX(N84:N100,MATCH(TRUE,L84:L100>=O66,0)),IF(O8=\"H\",INDEX(U84:U103,MATCH(TRUE,S84:S103>=O66,0)),0)))","v":{"v":5,"d":"5.0"}},{"$f":"IF(O8=\"T\",INDEX(F84:F100,MATCH(TRUE,E84:E100>=O66,0)),IF(O8=\"W\",INDEX(M84:M100,MATCH(TRUE,L84:L100>=O66,0)),IF(O8=\"H\",INDEX(T84:T103,MATCH(TRUE,S84:S103>=O66,0)),0)))","v":2},{"$f":"'Wyniki graficzne wiatr I'!Q28","v":{"v":8,"d":"8.0"}}]
[{"$nulls":9},"Ściana IV",{"$nulls":3},"Ściana II"]
[]
[]
[{"$nulls":6},{"$f":"'Wyniki graficzne wiatr I'!G32","v":{"v":8,"d":"8.0"}},{"$f":"IF(O8=\"T\",INDEX(F84:F100,MATCH(TRUE,E84:E100>=I67,0)),IF(O8=\"W\",INDEX(M84:M100,MATCH(TRUE,L84:L100>=I67,0)),IF(O8=\"H\",INDEX(T84:T103,MATCH(TRUE,S84:S103>=I67,0)),0)))","v":3},{"$f":"IF(O8=\"T\",INDEX(G84:G100,MATCH(TRUE,E84:E100>=I67,0)),IF(O8=\"W\",INDEX(N84:N100,MATCH(TRUE,L84:L100>=I67,0)),IF(O8=\"H\",INDEX(U84:U103,MATCH(TRUE,S84:S103>=I67,0)),0)))","v":{"v":6,"d":"6.0"}},{"$nulls":5},{"$f":"IF(O8=\"T\",INDEX(G84:G100,MATCH(TRUE,E84:E100>=O67,0)),IF(O8=\"W\",INDEX(N84:N100,MATCH(TRUE,L84:L100>=O67,0)),IF(O8=\"H\",INDEX(U84:U103,MATCH(TRUE,S84:S103>=O67,0)),0)))","v":{"v":6,"d":"6.0"}},{"$f":"IF(O8=\"T\",INDEX(F84:F100,MATCH(TRUE,E84:E100>=O67,0)),IF(O8=\"W\",INDEX(M84:M100,MATCH(TRUE,L84:L100>=O67,0)),IF(O8=\"H\",INDEX(T84:T103,MATCH(TRUE,S84:S103>=O67,0)),0)))","v":3},{"$f":"'Wyniki graficzne wiatr I'!Q32","v":{"v":8,"d":"8.0"}}]
[]
[]
[]
[{"$nulls":6},{"$f":"'Wyniki graficzne wiatr I'!G36","v":{"v":2,"d":"2.0"}},{"$f":"IF(O8=\"T\",INDEX(F84:F100,MATCH(TRUE,E84:E100>=I68,0)),IF(O8=\"W\",INDEX(M84:M100,MATCH(TRUE,L84:L100>=I68,0)),IF(O8=\"H\",INDEX(T84:T103,MATCH(TRUE,S84:S103>=I68,0)),0)))","v":5},{"$f":"IF(O8=\"T\",INDEX(G84:G100,MATCH(TRUE,E84:E100>=I68,0)),IF(O8=\"W\",INDEX(N84:N100,MATCH(TRUE,L84:L100>=I68,0)),IF(O8=\"H\",INDEX(U84:U103,MATCH(TRUE,S84:S103>=I68,0)),0)))","v":{"v":8,"d":"8.0"}},{"$nulls":5},{"$f":"IF(O8=\"T\",INDEX(G84:G100,MATCH(TRUE,E84:E100>=O68,0)),IF(O8=\"W\",INDEX(N84:N100,MATCH(TRUE,L84:L100>=O68,0)),IF(O8=\"H\",INDEX(U84:U103,MATCH(TRUE,S84:S103>=O68,0)),0)))","v":{"v":8,"d":"8.0"}},{"$f":"IF(O8=\"T\",INDEX(F84:F100,MATCH(TRUE,E84:E100>=O68,0)),IF(O8=\"W\",INDEX(M84:M100,MATCH(TRUE,L84:L100>=O68,0)),IF(O8=\"H\",INDEX(T84:T103,MATCH(TRUE,S84:S103>=O68,0)),0)))","v":5},{"$f":"'Wyniki graficzne wiatr I'!Q36","v":{"v":2,"d":"2.0"}}]
[]
[]
[{"$nulls":11},"Ściana III"]
[{"$nulls":8},"Łączniki szt./m²",{"$f":"IF(O8=\"T\",INDEX(G84:G100,MATCH(TRUE,E84:E100>=J69,0)),IF(O8=\"W\",INDEX(N84:N100,MATCH(TRUE,L84:L100>=J69,0)),IF(O8=\"H\",INDEX(U84:U103,MATCH(TRUE,S84:S103>=J69,0)),0)))","v":{"v":8,"d":"8.0"}},{"$f":"IF(O8=\"T\",INDEX(G84:G100,MATCH(TRUE,E84:E100>=K69,0)),IF(O8=\"W\",INDEX(N84:N100,MATCH(TRUE,L84:L100>=K69,0)),IF(O8=\"H\",INDEX(U84:U103,MATCH(TRUE,S84:S103>=K69,0)),0)))","v":{"v":8,"d":"8.0"}},{"$f":"IF(O8=\"T\",INDEX(G84:G100,MATCH(TRUE,E84:E100>=L69,0)),IF(O8=\"W\",INDEX(N84:N100,MATCH(TRUE,L84:L100>=L69,0)),IF(O8=\"H\",INDEX(U84:U103,MATCH(TRUE,S84:S103>=L69,0)),0)))","v":{"v":8,"d":"8.0"}},{"$f":"IF(O8=\"T\",INDEX(G84:G100,MATCH(TRUE,E84:E100>=M69,0)),IF(O8=\"W\",INDEX(N84:N100,MATCH(TRUE,L84:L100>=M69,0)),IF(O8=\"H\",INDEX(U84:U103,MATCH(TRUE,S84:S103>=M69,0)),0)))","v":{"v":8,"d":"8.0"}},{"$f":"IF(O8=\"T\",INDEX(G84:G100,MATCH(TRUE,E84:E100>=N69,0)),IF(O8=\"W\",INDEX(N84:N100,MATCH(TRUE,L84:L100>=N69,0)),IF(O8=\"H\",INDEX(U84:U103,MATCH(TRUE,S84:S103>=N69,0)),0)))","v":{"v":8,"d":"8.0"}}]
[]
[]
[{"$nulls":8},"Schemat",{"$f":"IF(O8=\"T\",INDEX(F84:F100,MATCH(TRUE,E84:E100>=J69,0)),IF(O8=\"W\",INDEX(M84:M100,MATCH(TRUE,L84:L100>=J69,0)),IF(O8=\"H\",INDEX(T84:T103,MATCH(TRUE,S84:S103>=J69,0)),0)))","v":5},{"$f":"IF(O8=\"T\",INDEX(F84:F100,MATCH(TRUE,E84:E100>=K69,0)),IF(O8=\"W\",INDEX(M84:M100,MATCH(TRUE,L84:L100>=K69,0)),IF(O8=\"H\",INDEX(T84:T103,MATCH(TRUE,S84:S103>=K69,0)),0)))","v":5},{"$f":"IF(O8=\"T\",INDEX(F84:F100,MATCH(TRUE,E84:E100>=L69,0)),IF(O8=\"W\",INDEX(M84:M100,MATCH(TRUE,L84:L100>=L69,0)),IF(O8=\"H\",INDEX(T84:T103,MATCH(TRUE,S84:S103>=L69,0)),0)))","v":5},{"$f":"IF(O8=\"T\",INDEX(F84:F100,MATCH(TRUE,E84:E100>=M69,0)),IF(O8=\"W\",INDEX(M84:M100,MATCH(TRUE,L84:L100>=M69,0)),IF(O8=\"H\",INDEX(T84:T103,MATCH(TRUE,S84:S103>=M69,0)),0)))","v":5},{"$f":"IF(O8=\"T\",INDEX(F84:F100,MATCH(TRUE,E84:E100>=N69,0)),IF(O8=\"W\",INDEX(M84:M100,MATCH(TRUE,L84:L100>=N69,0)),IF(O8=\"H\",INDEX(T84:T103,MATCH(TRUE,S84:S103>=N69,0)),0)))","v":5}]
[]
[{"$nulls":8},"m",{"$f":"'Wyniki graficzne wiatr I'!J45","v":""},{"$f":"'Wyniki graficzne wiatr I'!K45","v":""},{"$f":"'Wyniki graficzne wiatr I'!L45","v":""},{"$f":"'Wyniki graficzne wiatr I'!M45","v":""},{"$f":"'Wyniki graficzne wiatr I'!N45","v":{"v":10,"d":"10.0"}}]
[]
[]
[]
[{"$nulls":9},{"$f":"TEXT(N75+N76+N77,\"####0,0##\")&\" m\"","v":"10,0 m"}]
[]
[]
[{"$nulls":9},{"$f":"\"Wysokość  ze = \"&TEXT('Obliczenia wiatr I'!D46,\"####0,0##\")&\" m\"","v":"Wysokość  ze = 25,0 m"}]
[]
[]
[]
[]
[{"$nulls":9},"Wymagana nośność"]
[]
[{"$nulls":9},{"$f":"(1-O10/100)*'Wyniki graficzne wiatr I'!J15","v":{"v":2.075084304473848,"d":"2.0751"}},{"$f":"(1-O10/100)*'Wyniki graficzne wiatr I'!K15","v":{"v":2.075084304473848,"d":"2.0751"}},{"$f":"(1-O10/100)*'Wyniki graficzne wiatr I'!L15","v":{"v":2.075084304473848,"d":"2.0751"}},{"$f":"(1-O10/100)*'Wyniki graficzne wiatr I'!M15","v":{"v":2.075084304473848,"d":"2.0751"}},{"$f":"(1-O10/100)*'Wyniki graficzne wiatr I'!N15","v":{"v":2.075084304473848,"d":"2.0751"}}]
[{"$nulls":8},{"$f":"(1-O10/100)*'Wyniki graficzne wiatr I'!H20","v":{"v":2.075084304473848,"d":"2.0751"}},{"$nulls":5},{"$f":"(1-O10/100)*'Wyniki graficzne wiatr I'!O20","v":{"v":2.075084304473848,"d":"2.0751"}}]
[{"$nulls":8},{"$f":"(1-O10/100)*'Wyniki graficzne wiatr I'!H24","v":{"v":1.6304233820865948,"d":"1.6304"}},{"$nulls":5},{"$f":"(1-O10/100)*'Wyniki graficzne wiatr I'!O24","v":{"v":1.6304233820865948,"d":"1.6304"}}]
[{"$nulls":8},{"$f":"(1-O10/100)*'Wyniki graficzne wiatr I'!H28","v":{"v":0.8522667679089018,"d":"0.8523"}},{"$nulls":5},{"$f":"(1-O10/100)*'Wyniki graficzne wiatr I'!O28","v":{"v":0.8522667679089018,"d":"0.8523"}}]
[{"$nulls":8},{"$f":"(1-O10/100)*'Wyniki graficzne wiatr I'!H32","v":{"v":1.6304233820865948,"d":"1.6304"}},{"$nulls":5},{"$f":"(1-O10/100)*'Wyniki graficzne wiatr I'!O32","v":{"v":1.6304233820865948,"d":"1.6304"}}]
[{"$nulls":8},{"$f":"(1-O10/100)*'Wyniki graficzne wiatr I'!H36","v":{"v":2.075084304473848,"d":"2.0751"}},{"$nulls":5},{"$f":"(1-O10/100)*'Wyniki graficzne wiatr I'!O36","v":{"v":2.075084304473848,"d":"2.0751"}}]
[{"$nulls":9},{"$f":"(1-O10/100)*'Wyniki graficzne wiatr I'!J40","v":{"v":2.075084304473848,"d":"2.0751"}},{"$f":"(1-O10/100)*'Wyniki graficzne wiatr I'!K40","v":{"v":2.075084304473848,"d":"2.0751"}},{"$f":"(1-O10/100)*'Wyniki graficzne wiatr I'!L40","v":{"v":2.075084304473848,"d":"2.0751"}},{"$f":"(1-O10/100)*'Wyniki graficzne wiatr I'!M40","v":{"v":2.075084304473848,"d":"2.0751"}},{"$f":"(1-O10/100)*'Wyniki graficzne wiatr I'!N40","v":{"v":2.075084304473848,"d":"2.0751"}}]
[]
[]
[{"$nulls":9},"Tablica szerokości pól ściany"]
[]
[{"$nulls":10},"Ściana IV","Ściana I","Ściana II","Ściana III"]
[{"$nulls":9},"a",{"$f":"'Obliczenia wiatr I'!C31","v":2},{"$f":"'Obliczenia wiatr I'!D31","v":5.6},{"$f":"'Obliczenia wiatr I'!C31","v":2},{"$f":"'Obliczenia wiatr I'!D31","v":5.6}]
[{"$nulls":9},"b",{"$f":"'Obliczenia wiatr I'!C32","v":8},{"$f":"'Obliczenia wiatr I'!D32","v":4.4},{"$f":"'Obliczenia wiatr I'!C32","v":8},{"$f":"'Obliczenia wiatr I'!D32","v":4.4}]
[{"$nulls":9},"c",{"$f":"'Obliczenia wiatr I'!C33","v":{"v":18,"d":"18.0"}},{"$f":"'Obliczenia wiatr I'!D33","v":{"v":0,"d":"0.0"}},{"$f":"'Obliczenia wiatr I'!C33","v":{"v":18,"d":"18.0"}},{"$f":"'Obliczenia wiatr I'!D33","v":{"v":0,"d":"0.0"}}]
[]
[{"$nulls":9},"e (prost)",{"$f":"'Obliczenia wiatr I'!C25","v":{"v":10,"d":"10.0"}},{"$f":"'Obliczenia wiatr I'!D25","v":{"v":28,"d":"28.0"}},{"$f":"'Obliczenia wiatr I'!C25","v":{"v":10,"d":"10.0"}},{"$f":"'Obliczenia wiatr I'!D25","v":{"v":28,"d":"28.0"}}]
[]
[null,"T",{"$nulls":6},"W",{"$nulls":6},"H"]
[]
[null,"Schemat","Łączniki","Nośność","Nośność","Schemat","Łączniki",null,"Schemat","Łączniki","Nośność","Nośność","Schemat","Łączniki",null,"Schemat","Łączniki","Nośność","Nośność","Schemat","Łączniki"]
[null,1,{"$f":"'Obliczenia nośności T'!$D$13","v":{"v":4,"d":"4.00"}},{"$f":"IF($C$84<$O$9,0,'Obliczenia nośności T'!$D$29)","v":{"v":0,"d":"0.00"}},{"$f":"SMALL(D84:D100,1)","v":{"v":0,"d":"0.00"}},{"$f":"INDEX(B84:B100,MATCH(E84,D84:D100,))","v":1},{"$f":"INDEX(C84:C100,MATCH(E84,D84:D100,))","v":{"v":4,"d":"4.0"}},null,1,{"$f":"'Obliczenia nośności W'!$D$13","v":{"v":3.3333333333333335,"d":"3.33"}},{"$f":"IF($J$84<$O$9,0,'Obliczenia nośności W'!$D$29)","v":{"v":0,"d":"0.00"}},{"$f":"SMALL(K84:K100,1)","v":{"v":0,"d":"0.00"}},{"$f":"INDEX(I84:I100,MATCH(L84,K84:K100,))","v":1},{"$f":"INDEX(J84:J100,MATCH(L84,K84:K100,))","v":{"v":3.3333333333333335,"d":"3.3"}},null,1,{"$f":"'Obliczenia nośności H'!$D$27","v":{"v":4.166666666666667,"d":"4.17"}},{"$f":"IF($Q$84<$O$9,0,'Obliczenia nośności H'!$D$43)","v":{"v":0,"d":"0.00"}},{"$f":"SMALL(R84:R103,1)","v":{"v":0,"d":"0.00"}},{"$f":"INDEX(P84:P103,MATCH(S84,R84:R103,))","v":1},{"$f":"INDEX(Q84:Q103,MATCH(S84,R84:R103,))","v":{"v":4.166666666666667,"d":"4.2"}}]
[null,2,{"$f":"'Obliczenia nośności T'!$E$13","v":{"v":5,"d":"5.00"}},{"$f":"IF($C$85<$O$9,0,'Obliczenia nośności T'!$E$29)","v":1.36},{"$f":"SMALL(D84:D100,2)","v":1.36},{"$f":"INDEX(B84:B100,MATCH(E85,D84:D100,))","v":2},{"$f":"INDEX(C84:C100,MATCH(E85,D84:D100,))","v":{"v":5,"d":"5.0"}},null,2,{"$f":"'Obliczenia nośności W'!$E$13","v":{"v":4.166666666666667,"d":"4.17"}},{"$f":"IF($J$85<$O$9,0,'Obliczenia nośności W'!$E$29)","v":{"v":0,"d":"0.00"}},{"$f":"SMALL(K84:K100,2)","v":{"v":0,"d":"0.00"}},{"$f":"INDEX(I84:I100,MATCH(L85,K84:K100,))","v":1},{"$f":"INDEX(J84:J100,MATCH(L85,K84:K100,))","v":{"v":3.3333333333333335,"d":"3.3"}},null,2,{"$f":"'Obliczenia nośności H'!$E$27","v":{"v":5.208333333333334,"d":"5.21"}},{"$f":"IF($Q$85<$O$9,0,'Obliczenia nośności H'!$E$43)","v":{"v":1.484375,"d":"1.48"}},{"$f":"SMALL(R84:R103,2)","v":{"v":0,"d":"0.00"}},{"$f":"INDEX(P84:P103,MATCH(S85,R84:R103,))","v":1},{"$f":"INDEX(Q84:Q103,MATCH(S85,R84:R103,))","v":{"v":4.166666666666667,"d":"4.2"}}]
[null,3,{"$f":"'Obliczenia nośności T'!$F$13","v":{"v":6,"d":"6.00"}},{"$f":"IF($C$86<$O$9,0,'Obliczenia nośności T'!$F$29)","v":{"v":1.6800000000000002,"d":"1.68"}},{"$f":"SMALL(D84:D100,3)","v":{"v":1.6800000000000002,"d":"1.68"}},{"$f":"INDEX(B84:B100,MATCH(E86,D84:D100,))","v":3},{"$f":"INDEX(C84:C100,MATCH(E86,D84:D100,))","v":{"v":6,"d":"6.0"}},null,3,{"$f":"'Obliczenia nośności W'!$F$13","v":{"v":5,"d":"5.00"}},{"$f":"IF($J$86<$O$9,0,'Obliczenia nośności W'!$F$29)","v":{"v":0.925,"d":"0.93"}},{"$f":"SMALL(K84:K100,3)","v":{"v":0,"d":"0.00"}},{"$f":"INDEX(I84:I100,MATCH(L86,K84:K100,))","v":1},{"$f":"INDEX(J84:J100,MATCH(L86,K84:K100,))","v":{"v":3.3333333333333335,"d":"3.3"}},null,3,{"$f":"'Obliczenia nośności H'!$F$27","v":6.25},{"$f":"IF($Q$86<$O$9,0,'Obliczenia nośności H'!$F$43)","v":{"v":1.78125,"d":"1.78"}},{"$f":"SMALL(R84:R103,3)","v":{"v":1.484375,"d":"1.48"}},{"$f":"INDEX(P84:P103,MATCH(S86,R84:R103,))","v":2},{"$f":"INDEX(Q84:Q103,MATCH(S86,R84:R103,))","v":{"v":5.208333333333334,"d":"5.2"}}]
[null,4,{"$f":"'Obliczenia nośności T'!$G$13","v":{"v":7,"d":"7.00"}},{"$f":"IF($C$87<$O$9,0,'Obliczenia nośności T'!$G$29)","v":{"v":2,"d":"2.00"}},{"$f":"SMALL(D84:D100,4)","v":{"v":2,"d":"2.00"}},{"$f":"INDEX(B84:B100,MATCH(E87,D84:D100,))","v":4},{"$f":"INDEX(C84:C100,MATCH(E87,D84:D100,))","v":{"v":7,"d":"7.0"}},null,4,{"$f":"'Obliczenia nośności W'!$G$13","v":{"v":5.833333333333334,"d":"5.83"}},{"$f":"IF($J$87<$O$9,0,'Obliczenia nośności W'!$G$29)","v":{"v":1.0791666666666668,"d":"1.08"}},{"$f":"SMALL(K84:K100,4)","v":{"v":0.925,"d":"0.93"}},{"$f":"INDEX(I84:I100,MATCH(L87,K84:K100,))","v":3},{"$f":"INDEX(J84:J100,MATCH(L87,K84:K100,))","v":{"v":5,"d":"5.0"}},null,4,{"$f":"'Obliczenia nośności H'!$G$27","v":{"v":7.291666666666667,"d":"7.29"}},{"$f":"IF($Q$87<$O$9,0,'Obliczenia nośności H'!$G$43)","v":{"v":2.078125,"d":"2.08"}},{"$f":"SMALL(R84:R103,4)","v":{"v":1.7812499999999998,"d":"1.78"}},{"$f":"INDEX(P84:P103,MATCH(S87,R84:R103,))","v":14},{"$f":"INDEX(Q84:Q103,MATCH(S87,R84:R103,))","v":{"v":6.25,"d":"6.3"}}]
[null,5,{"$f":"'Obliczenia nośności T'!$H$13","v":{"v":8,"d":"8.00"}},{"$f":"IF($C$88<$O$9,0,'Obliczenia nośności T'!$H$29)","v":{"v":2.3200000000000003,"d":"2.32"}},{"$f":"SMALL(D84:D100,5)","v":{"v":2.3200000000000003,"d":"2.32"}},{"$f":"INDEX(B84:B100,MATCH(E88,D84:D100,))","v":5},{"$f":"INDEX(C84:C100,MATCH(E88,D84:D100,))","v":{"v":8,"d":"8.0"}},null,5,{"$f":"'Obliczenia nośności W'!$H$13","v":{"v":6.666666666666667,"d":"6.67"}},{"$f":"IF($J$88<$O$9,0,'Obliczenia nośności W'!$H$29)","v":{"v":1.2333333333333334,"d":"1.23"}},{"$f":"SMALL(K84:K100,5)","v":{"v":1.0791666666666668,"d":"1.08"}},{"$f":"INDEX(I84:I100,MATCH(L88,K84:K100,))","v":4},{"$f":"INDEX(J84:J100,MATCH(L88,K84:K100,))","v":{"v":5.833333333333334,"d":"5.8"}},null,5,{"$f":"'Obliczenia nośności H'!$H$27","v":{"v":8.333333333333334,"d":"8.33"}},{"$f":"IF($Q$88<$O$9,0,'Obliczenia nośności H'!$H$43)","v":{"v":2.375,"d":"2.38"}},{"$f":"SMALL(R84:R103,5)","v":{"v":1.78125,"d":"1.78"}},{"$f":"INDEX(P84:P103,MATCH(S88,R84:R103,))","v":3},{"$f":"INDEX(Q84:Q103,MATCH(S88,R84:R103,))","v":{"v":6.25,"d":"6.3"}}]
[null,6,{"$f":"'Obliczenia nośności T'!$I$13","v":{"v":9,"d":"9.00"}},{"$f":"IF($C$89<$O$9,0,'Obliczenia nośności T'!$I$29)","v":2.64},{"$f":"SMALL(D84:D100,6)","v":2.64},{"$f":"INDEX(B84:B100,MATCH(E89,D84:D100,))","v":6},{"$f":"INDEX(C84:C100,MATCH(E89,D84:D100,))","v":{"v":9,"d":"9.0"}},null,6,{"$f":"'Obliczenia nośności W'!$I$13","v":{"v":7.5,"d":"7.50"}},{"$f":"IF($J$89<$O$9,0,'Obliczenia nośności W'!$I$29)","v":{"v":1.3875,"d":"1.39"}},{"$f":"SMALL(K84:K100,6)","v":{"v":1.2333333333333334,"d":"1.23"}},{"$f":"INDEX(I84:I100,MATCH(L89,K84:K100,))","v":5},{"$f":"INDEX(J84:J100,MATCH(L89,K84:K100,))","v":{"v":6.666666666666667,"d":"6.7"}},null,6,{"$f":"'Obliczenia nośności H'!$I$27","v":{"v":9.375,"d":"9.38"}},{"$f":"IF($Q$89<$O$9,0,'Obliczenia nośności H'!$I$43)","v":{"v":2.671875,"d":"2.67"}},{"$f":"SMALL(R84:R103,6)","v":{"v":2.078125,"d":"2.08"}},{"$f":"INDEX(P84:P103,MATCH(S89,R84:R103,))","v":4},{"$f":"INDEX(Q84:Q103,MATCH(S89,R84:R103,))","v":{"v":7.291666666666667,"d":"7.3"}}]
[null,7,{"$f":"'Obliczenia nośności T'!$J$13","v":{"v":10,"d":"10.00"}},{"$f":"IF($C$90<$O$9,0,'Obliczenia nośności T'!$J$29)","v":2.96},{"$f":"SMALL(D84:D100,7)","v":2.84},{"$f":"INDEX(B84:B100,MATCH(E90,D84:D100,))","v":17},{"$f":"INDEX(C84:C100,MATCH(E90,D84:D100,))","v":{"v":10,"d":"10.0"}},null,7,{"$f":"'Obliczenia nośności W'!$J$13","v":{"v":8.333333333333334,"d":"8.33"}},{"$f":"IF($J$90<$O$9,0,'Obliczenia nośności W'!$J$29)","v":{"v":1.5416666666666667,"d":"1.54"}},{"$f":"SMALL(K84:K100,7)","v":{"v":1.3875,"d":"1.39"}},{"$f":"INDEX(I84:I100,MATCH(L90,K84:K100,))","v":6},{"$f":"INDEX(J84:J100,MATCH(L90,K84:K100,))","v":7.5},null,7,{"$f":"'Obliczenia nośności H'!$J$27","v":{"v":10.416666666666668,"d":"10.42"}},{"$f":"IF($Q$90<$O$9,0,'Obliczenia nośności H'!$J$43)","v":{"v":2.96875,"d":"2.97"}},{"$f":"SMALL(R84:R103,7)","v":{"v":2.375,"d":"2.38"}},{"$f":"INDEX(P84:P103,MATCH(S90,R84:R103,))","v":5},{"$f":"INDEX(Q84:Q103,MATCH(S90,R84:R103,))","v":{"v":8.333333333333334,"d":"8.3"}}]
[null,8,{"$f":"'Obliczenia nośności T'!$K$13","v":{"v":11,"d":"11.00"}},{"$f":"IF($C$91<$O$9,0,'Obliczenia nośności T'!$K$29)","v":{"v":3.2800000000000002,"d":"3.28"}},{"$f":"SMALL(D84:D100,8)","v":2.96},{"$f":"INDEX(B84:B100,MATCH(E91,D84:D100,))","v":7},{"$f":"INDEX(C84:C100,MATCH(E91,D84:D100,))","v":{"v":10,"d":"10.0"}},null,8,{"$f":"'Obliczenia nośności W'!$K$13","v":{"v":9.166666666666668,"d":"9.17"}},{"$f":"IF($J$91<$O$9,0,'Obliczenia nośności W'!$K$29)","v":{"v":1.6958333333333335,"d":"1.70"}},{"$f":"SMALL(K84:K100,8)","v":{"v":1.5416666666666667,"d":"1.54"}},{"$f":"INDEX(I84:I100,MATCH(L91,K84:K100,))","v":7},{"$f":"INDEX(J84:J100,MATCH(L91,K84:K100,))","v":{"v":8.333333333333334,"d":"8.3"}},null,8,{"$f":"'Obliczenia nośności H'!$K$27","v":{"v":11.458333333333334,"d":"11.46"}},{"$f":"IF($Q$91<$O$9,0,'Obliczenia nośności H'!$K$43)","v":{"v":3.265625,"d":"3.27"}},{"$f":"SMALL(R84:R103,8)","v":{"v":2.375,"d":"2.38"}},{"$f":"INDEX(P84:P103,MATCH(S91,R84:R103,))","v":5},{"$f":"INDEX(Q84:Q103,MATCH(S91,R84:R103,))","v":{"v":8.333333333333334,"d":"8.3"}}]
[null,9,{"$f":"'Obliczenia nośności T'!$L$13","v":{"v":12,"d":"12.00"}},{"$f":"IF($C$92<$O$9,0,'Obliczenia nośności T'!$L$29)","v":{"v":3.6,"d":"3.60"}},{"$f":"SMALL(D84:D100,9)","v":{"v":3.2800000000000002,"d":"3.28"}},{"$f":"INDEX(B84:B100,MATCH(E92,D84:D100,))","v":8},{"$f":"INDEX(C84:C100,MATCH(E92,D84:D100,))","v":{"v":11,"d":"11.0"}},null,9,{"$f":"'Obliczenia nośności W'!$L$13","v":{"v":10,"d":"10.00"}},{"$f":"IF($J$92<$O$9,0,'Obliczenia nośności W'!$L$29)","v":1.85},{"$f":"SMALL(K84:K100,9)","v":{"v":1.6958333333333335,"d":"1.70"}},{"$f":"INDEX(I84:I100,MATCH(L92,K84:K100,))","v":8},{"$f":"INDEX(J84:J100,MATCH(L92,K84:K100,))","v":{"v":9.166666666666668,"d":"9.2"}},null,9,{"$f":"'Obliczenia nośności H'!$L$27","v":{"v":12.5,"d":"12.50"}},{"$f":"IF($Q$92<$O$9,0,'Obliczenia nośności H'!$L$43)","v":{"v":3.5625,"d":"3.56"}},{"$f":"SMALL(R84:R103,9)","v":{"v":2.671875,"d":"2.67"}},{"$f":"INDEX(P84:P103,MATCH(S92,R84:R103,))","v":6},{"$f":"INDEX(Q84:Q103,MATCH(S92,R84:R103,))","v":{"v":9.375,"d":"9.4"}}]
[null,10,{"$f":"'Obliczenia nośności T'!$M$13","v":{"v":12,"d":"12.00"}},{"$f":"IF($C$93<$O$9,0,'Obliczenia nośności T'!$M$29)","v":3.48},{"$f":"SMALL(D84:D100,10)","v":3.48},{"$f":"INDEX(B84:B100,MATCH(E93,D84:D100,))","v":10},{"$f":"INDEX(C84:C100,MATCH(E93,D84:D100,))","v":{"v":12,"d":"12.0"}},null,10,{"$f":"'Obliczenia nośności W'!$M$13","v":{"v":10.833333333333334,"d":"10.83"}},{"$f":"IF($J$93<$O$9,0,'Obliczenia nośności W'!$M$29)","v":{"v":2.0208333333333335,"d":"2.02"}},{"$f":"SMALL(K84:K100,10)","v":1.85},{"$f":"INDEX(I84:I100,MATCH(L93,K84:K100,))","v":9},{"$f":"INDEX(J84:J100,MATCH(L93,K84:K100,))","v":{"v":10,"d":"10.0"}},null,10,{"$f":"'Obliczenia nośności H'!$M$27","v":{"v":13.541666666666668,"d":"13.54"}},{"$f":"IF($Q$93<$O$9,0,'Obliczenia nośności H'!$M$43)","v":{"v":3.8593749999999996,"d":"3.86"}},{"$f":"SMALL(R84:R103,10)","v":{"v":2.96875,"d":"2.97"}},{"$f":"INDEX(P84:P103,MATCH(S93,R84:R103,))","v":7},{"$f":"INDEX(Q84:Q103,MATCH(S93,R84:R103,))","v":{"v":10.416666666666668,"d":"10.4"}}]
[null,11,{"$f":"'Obliczenia nośności T'!$N$13","v":{"v":13,"d":"13.00"}},{"$f":"IF($C$94<$O$9,0,'Obliczenia nośności T'!$N$29)","v":3.92},{"$f":"SMALL(D84:D100,11)","v":{"v":3.6,"d":"3.60"}},{"$f":"INDEX(B84:B100,MATCH(E94,D84:D100,))","v":9},{"$f":"INDEX(C84:C100,MATCH(E94,D84:D100,))","v":{"v":12,"d":"12.0"}},null,11,{"$f":"'Obliczenia nośności W'!$N$13","v":{"v":11.666666666666668,"d":"11.67"}},{"$f":"IF($J$94<$O$9,0,'Obliczenia nośności W'!$N$29)","v":{"v":2.191666666666667,"d":"2.19"}},{"$f":"SMALL(K84:K100,11)","v":{"v":2.0208333333333335,"d":"2.02"}},{"$f":"INDEX(I84:I100,MATCH(L94,K84:K100,))","v":10},{"$f":"INDEX(J84:J100,MATCH(L94,K84:K100,))","v":{"v":10.833333333333334,"d":"10.8"}},null,11,{"$f":"'Obliczenia nośności H'!$N$27","v":{"v":14.583333333333334,"d":"14.58"}},{"$f":"IF($Q$94<$O$9,0,'Obliczenia nośności H'!$N$43)","v":{"v":4.15625,"d":"4.16"}},{"$f":"SMALL(R84:R103,11)","v":{"v":2.96875,"d":"2.97"}},{"$f":"INDEX(P84:P103,MATCH(S94,R84:R103,))","v":7},{"$f":"INDEX(Q84:Q103,MATCH(S94,R84:R103,))","v":{"v":10.416666666666668,"d":"10.4"}}]
[null,12,{"$f":"'Obliczenia nośności T'!$O$13","v":{"v":13,"d":"13.00"}},{"$f":"IF($C$95<$O$9,0,'Obliczenia nośności T'!$O$29)","v":{"v":3.8000000000000003,"d":"3.80"}},{"$f":"SMALL(D84:D100,12)","v":{"v":3.8000000000000003,"d":"3.80"}},{"$f":"INDEX(B84:B100,MATCH(E95,D84:D100,))","v":12},{"$f":"INDEX(C84:C100,MATCH(E95,D84:D100,))","v":{"v":13,"d":"13.0"}},null,12,{"$f":"'Obliczenia nośności W'!$O$13","v":{"v":12.5,"d":"12.50"}},{"$f":"IF($J$95<$O$9,0,'Obliczenia nośności W'!$O$29)","v":{"v":2.3625,"d":"2.36"}},{"$f":"SMALL(K84:K100,12)","v":{"v":2.191666666666667,"d":"2.19"}},{"$f":"INDEX(I84:I100,MATCH(L95,K84:K100,))","v":11},{"$f":"INDEX(J84:J100,MATCH(L95,K84:K100,))","v":{"v":11.666666666666668,"d":"11.7"}},null,12,{"$f":"'Obliczenia nośności H'!$O$27","v":{"v":15.625,"d":"15.63"}},{"$f":"IF($Q$95<$O$9,0,'Obliczenia nośności H'!$O$43)","v":{"v":4.453125,"d":"4.45"}},{"$f":"SMALL(R84:R103,12)","v":{"v":3.265625,"d":"3.27"}},{"$f":"INDEX(P84:P103,MATCH(S95,R84:R103,))","v":8},{"$f":"INDEX(Q84:Q103,MATCH(S95,R84:R103,))","v":{"v":11.458333333333334,"d":"11.5"}}]
[null,13,{"$f":"'Obliczenia nośności T'!$P$13","v":{"v":14,"d":"14.00"}},{"$f":"IF($C$96<$O$9,0,'Obliczenia nośności T'!$P$29)","v":4.24},{"$f":"SMALL(D84:D100,13)","v":3.92},{"$f":"INDEX(B84:B100,MATCH(E96,D84:D100,))","v":11},{"$f":"INDEX(C84:C100,MATCH(E96,D84:D100,))","v":{"v":13,"d":"13.0"}},null,13,{"$f":"'Obliczenia nośności W'!$P$13","v":{"v":13.333333333333334,"d":"13.33"}},{"$f":"IF($J$96<$O$9,0,'Obliczenia nośności W'!$P$29)","v":{"v":2.533333333333333,"d":"2.53"}},{"$f":"SMALL(K84:K100,13)","v":{"v":2.3625,"d":"2.36"}},{"$f":"INDEX(I84:I100,MATCH(L96,K84:K100,))","v":12},{"$f":"INDEX(J84:J100,MATCH(L96,K84:K100,))","v":12.5},null,13,{"$f":"'Obliczenia nośności H'!$P$27","v":{"v":4.166666666666667,"d":"4.17"}},{"$f":"IF($Q$96<$O$9,0,'Obliczenia nośności H'!$P$43)","v":{"v":0,"d":"0.00"}},{"$f":"SMALL(R84:R103,13)","v":{"v":3.5624999999999996,"d":"3.56"}},{"$f":"INDEX(P84:P103,MATCH(S96,R84:R103,))","v":17},{"$f":"INDEX(Q84:Q103,MATCH(S96,R84:R103,))","v":12.5}]
[null,14,{"$f":"'Obliczenia nośności T'!$Q$13","v":{"v":14,"d":"14.00"}},{"$f":"IF($C$97<$O$9,0,'Obliczenia nośności T'!$Q$29)","v":4.12},{"$f":"SMALL(D84:D100,14)","v":4.12},{"$f":"INDEX(B84:B100,MATCH(E97,D84:D100,))","v":14},{"$f":"INDEX(C84:C100,MATCH(E97,D84:D100,))","v":{"v":14,"d":"14.0"}},null,14,{"$f":"'Obliczenia nośności W'!$Q$13","v":{"v":3.3333333333333335,"d":"3.33"}},{"$f":"IF($J$97<$O$9,0,'Obliczenia nośności W'!$Q$29)","v":{"v":0,"d":"0.00"}},{"$f":"SMALL(K84:K100,14)","v":{"v":2.533333333333333,"d":"2.53"}},{"$f":"INDEX(I84:I100,MATCH(L97,K84:K100,))","v":13},{"$f":"INDEX(J84:J100,MATCH(L97,K84:K100,))","v":{"v":13.333333333333334,"d":"13.3"}},null,14,{"$f":"'Obliczenia nośności H'!$Q$27","v":6.25},{"$f":"IF($Q$97<$O$9,0,'Obliczenia nośności H'!$Q$43)","v":{"v":1.7812499999999998,"d":"1.78"}},{"$f":"SMALL(R84:R103,14)","v":{"v":3.5625,"d":"3.56"}},{"$f":"INDEX(P84:P103,MATCH(S97,R84:R103,))","v":9},{"$f":"INDEX(Q84:Q103,MATCH(S97,R84:R103,))","v":12.5}]
[null,15,{"$f":"'Obliczenia nośności T'!$R$13","v":{"v":15,"d":"15.00"}},{"$f":"IF($C$98<$O$9,0,'Obliczenia nośności T'!$R$29)","v":{"v":4.4399999999999995,"d":"4.44"}},{"$f":"SMALL(D84:D100,15)","v":4.24},{"$f":"INDEX(B84:B100,MATCH(E98,D84:D100,))","v":13},{"$f":"INDEX(C84:C100,MATCH(E98,D84:D100,))","v":{"v":14,"d":"14.0"}},{"$nulls":8},15,{"$f":"'Obliczenia nośności H'!$R$27","v":{"v":8.333333333333334,"d":"8.33"}},{"$f":"IF($Q$98<$O$9,0,'Obliczenia nośności H'!$R$43)","v":{"v":2.375,"d":"2.38"}},{"$f":"SMALL(R84:R103,15)","v":{"v":3.8593749999999996,"d":"3.86"}},{"$f":"INDEX(P84:P103,MATCH(S98,R84:R103,))","v":10},{"$f":"INDEX(Q84:Q103,MATCH(S98,R84:R103,))","v":{"v":13.541666666666668,"d":"13.5"}}]
[null,16,{"$f":"'Obliczenia nośności T'!$S$13","v":{"v":16,"d":"16.00"}},{"$f":"IF($C$99<$O$9,0,'Obliczenia nośności T'!$S$29)","v":4.76},{"$f":"SMALL(D84:D100,16)","v":{"v":4.4399999999999995,"d":"4.44"}},{"$f":"INDEX(B84:B100,MATCH(E99,D84:D100,))","v":15},{"$f":"INDEX(C84:C100,MATCH(E99,D84:D100,))","v":{"v":15,"d":"15.0"}},{"$nulls":8},16,{"$f":"'Obliczenia nośności H'!$S$27","v":{"v":10.416666666666668,"d":"10.42"}},{"$f":"IF($Q$99<$O$9,0,'Obliczenia nośności H'!$S$43)","v":{"v":2.96875,"d":"2.97"}},{"$f":"SMALL(R84:R103,16)","v":{"v":4.15625,"d":"4.16"}},{"$f":"INDEX(P84:P103,MATCH(S99,R84:R103,))","v":11},{"$f":"INDEX(Q84:Q103,MATCH(S99,R84:R103,))","v":{"v":14.583333333333334,"d":"14.6"}}]
[null,17,{"$f":"'Obliczenia nośności T'!$T$13","v":{"v":10,"d":"10.00"}},{"$f":"IF($C$100<$O$9,0,'Obliczenia nośności T'!$T$29)","v":2.84},{"$f":"SMALL(D84:D100,17)","v":4.76},{"$f":"INDEX(B84:B100,MATCH(E100,D84:D100,))","v":16},{"$f":"INDEX(C84:C100,MATCH(E100,D84:D100,))","v":{"v":16,"d":"16.0"}},{"$nulls":8},17,{"$f":"'Obliczenia nośności H'!$T$27","v":{"v":12.5,"d":"12.50"}},{"$f":"IF($Q$100<$O$9,0,'Obliczenia nośności H'!$T$43)","v":{"v":3.5624999999999996,"d":"3.56"}},{"$f":"SMALL(R84:R103,17)","v":{"v":4.15625,"d":"4.16"}},{"$f":"INDEX(P84:P103,MATCH(S100,R84:R103,))","v":11},{"$f":"INDEX(Q84:Q103,MATCH(S100,R84:R103,))","v":{"v":14.583333333333334,"d":"14.6"}}]
[{"$nulls":15},18,{"$f":"'Obliczenia nośności H'!$U$27","v":{"v":14.583333333333334,"d":"14.58"}},{"$f":"IF($Q$101<$O$9,0,'Obliczenia nośności H'!$U$43)","v":{"v":4.15625,"d":"4.16"}},{"$f":"SMALL(R84:R103,18)","v":{"v":4.453125,"d":"4.45"}},{"$f":"INDEX(P84:P103,MATCH(S101,R84:R103,))","v":12},{"$f":"INDEX(Q84:Q103,MATCH(S101,R84:R103,))","v":{"v":15.625,"d":"15.6"}}]
[{"$nulls":15},19,{"$f":"'Obliczenia nośności H'!$V$27","v":{"v":16.666666666666668,"d":"16.67"}},{"$f":"IF($Q$102<$O$9,0,'Obliczenia nośności H'!$V$43)","v":4.75},{"$f":"SMALL(R84:R103,19)","v":4.75},{"$f":"INDEX(P84:P103,MATCH(S102,R84:R103,))","v":19},{"$f":"INDEX(Q84:Q103,MATCH(S102,R84:R103,))","v":{"v":16.666666666666668,"d":"16.7"}}]
[{"$nulls":15},20,{"$f":"'Obliczenia nośności H'!$W$27","v":{"v":20.833333333333336,"d":"20.83"}},{"$f":"IF($Q$103<$O$9,0,'Obliczenia nośności H'!$W$43)","v":{"v":5.9375,"d":"5.94"}},{"$f":"SMALL(R84:R103,20)","v":{"v":5.9375,"d":"5.94"}},{"$f":"INDEX(P84:P103,MATCH(S103,R84:R103,))","v":20},{"$f":"INDEX(Q84:Q103,MATCH(S103,R84:R103,))","v":{"v":20.833333333333336,"d":"20.8"}}]
[{"$nulls":11},"Schematy"]
[{"$nulls":11},"T"]
[{"$nulls":11},"W"]
[{"$nulls":11},"H"]

{"sheet":"Łączniki wiatr II","index":10,"n_rows":107,"n_cols":21,"rows_kept":107,"merged":[[1,1,2,21],[3,1,3,21],[5,1,5,21],[7,8,7,13],[8,8,8,13],[9,8,9,13],[11,9,13,13],[14,8,17,8],[14,9,17,9],[14,10,17,10],[14,11,17,11],[14,12,17,12],[14,13,17,13],[18,8,19,8],[18,9,19,9],[18,10,19,10],[18,11,19,11],[18,12,19,12],[18,13,19,13],[18,14,19,14],[20,8,22,8],[20,9,22,9],[20,10,22,10],[20,11,22,11],[20,12,22,12],[20,13,22,13],[20,14,22,14],[23,4,42,4],[23,5,42,5],[23,6,26,6],[23,7,26,7],[23,8,26,8],[23,10,42,10],[23,14,26,14],[23,15,26,15],[23,16,26,16],[23,17,42,17],[24,9,25,9],[27,6,30,6],[27,7,30,7],[27,8,30,8],[27,14,30,14],[27,15,30,15],[27,16,30,16],[28,9,29,9],[31,6,34,6],[31,7,34,7],[31,8,34,8],[31,14,34,14],[31,15,34,15],[31,16,34,16],[32,9,33,9],[32,11,33,11],[32,13,33,13],[35,6,38,6],[35,7,38,7],[35,8,38,8],[35,14,38,14],[35,15,38,15],[35,16,38,16],[36,9,37,9],[39,6,42,6],[39,7,42,7],[39,8,42,8],[39,14,42,14],[39,15,42,15],[39,16,42,16],[40,9,41,9],[43,8,45,8],[43,9,45,9],[43,10,45,10],[43,11,45,11],[43,12,45,12],[43,13,45,13],[46,8,47,8],[46,9,47,9],[46,10,47,10],[46,11,47,11],[46,12,47,12],[46,13,47,13],[48,8,51,8],[48,9,51,9],[48,10,51,10],[48,11,51,11],[48,12,51,12],[48,13,51,13],[52,9,54,13],[55,9,57,13],[60,9,60,13],[71,9,71,13],[80,1,80,6],[80,8,80,13],[80,15,80,20]]}
[]
[null,"Określenie liczby łączników mechanicznych ze względu na nośność, przy oddziaływaniu wiatru II"]
[]
[null,"Wiatr II - różne warunki w zależności od kierunku"]
[]
[null,"UWAGA! Wymiary rzutu budynku i szerokości pól ściany nie są pokazywane w skali."]
[]
[{"$nulls":8},"Układ łączników",{"$nulls":5},"T"]
[{"$nulls":8},"Minimalna liczba łączników, szt./m²",{"$nulls":5},{"v":5,"d":"5.0"}]
[{"$nulls":8},"Dopuszczalne niedoszacowanie nośności, %",{"$nulls":5},{"v":3,"d":"3.0"}]
[]
[{"$nulls":9},{"$f":"\"Wysokość  ze = \"&TEXT('Obliczenia wiatr II'!E42,\"####0,0##\")&\" m\"","v":"Wysokość  ze = 25,0 m"}]
[]
[]
[{"$nulls":8},"m",{"$f":"'Wyniki graficzne wiatr II'!J11","v":5.6},{"$f":"'Wyniki graficzne wiatr II'!K11","v":""},{"$f":"'Wyniki graficzne wiatr II'!L11","v":4.4},{"$f":"'Wyniki graficzne wiatr II'!M11","v":""},{"$f":"'Wyniki graficzne wiatr II'!N11","v":""}]
[]
[]
[]
[{"$nulls":8},"Schemat",{"$f":"IF(O8=\"T\",INDEX(F84:F100,MATCH(TRUE,E84:E100>=J63,0)),IF(O8=\"W\",INDEX(M84:M100,MATCH(TRUE,L84:L100>=J63,0)),IF(O8=\"H\",INDEX(T84:T103,MATCH(TRUE,S84:S103>=J63,0)),0)))","v":5},{"$f":"IF(O8=\"T\",INDEX(F84:F100,MATCH(TRUE,E84:E100>=K63,0)),IF(O8=\"W\",INDEX(M84:M100,MATCH(TRUE,L84:L100>=K63,0)),IF(O8=\"H\",INDEX(T84:T103,MATCH(TRUE,S84:S103>=K63,0)),0)))","v":5},{"$f":"IF(O8=\"T\",INDEX(F84:F100,MATCH(TRUE,E84:E100>=L63,0)),IF(O8=\"W\",INDEX(M84:M100,MATCH(TRUE,L84:L100>=L63,0)),IF(O8=\"H\",INDEX(T84:T103,MATCH(TRUE,S84:S103>=L63,0)),0)))","v":3},{"$f":"IF(O8=\"T\",INDEX(F84:F100,MATCH(TRUE,E84:E100>=M63,0)),IF(O8=\"W\",INDEX(M84:M100,MATCH(TRUE,L84:L100>=M63,0)),IF(O8=\"H\",INDEX(T84:T103,MATCH(TRUE,S84:S103>=M63,0)),0)))","v":3},{"$f":"IF(O8=\"T\",INDEX(F84:F100,MATCH(TRUE,E84:E100>=N63,0)),IF(O8=\"W\",INDEX(M84:M100,MATCH(TRUE,L84:L100>=N63,0)),IF(O8=\"H\",INDEX(T84:T103,MATCH(TRUE,S84:S103>=N63,0)),0)))","v":3},"Schemat"]
[]
[{"$nulls":8},"Łączniki szt./m²",{"$f":"IF(O8=\"T\",INDEX(G84:G100,MATCH(TRUE,E84:E100>=J63,0)),IF(O8=\"W\",INDEX(N84:N100,MATCH(TRUE,L84:L100>=J63,0)),IF(O8=\"H\",INDEX(U84:U103,MATCH(TRUE,S84:S103>=J63,0)),0)))","v":{"v":8,"d":"8.0"}},{"$f":"IF(O8=\"T\",INDEX(G84:G100,MATCH(TRUE,E84:E100>=K63,0)),IF(O8=\"W\",INDEX(N84:N100,MATCH(TRUE,L84:L100>=K63,0)),IF(O8=\"H\",INDEX(U84:U103,MATCH(TRUE,S84:S103>=K63,0)),0)))","v":{"v":8,"d":"8.0"}},{"$f":"IF(O8=\"T\",INDEX(G84:G100,MATCH(TRUE,E84:E100>=L63,0)),IF(O8=\"W\",INDEX(N84:N100,MATCH(TRUE,L84:L100>=L63,0)),IF(O8=\"H\",INDEX(U84:U103,MATCH(TRUE,S84:S103>=L63,0)),0)))","v":{"v":6,"d":"6.0"}},{"$f":"IF(O8=\"T\",INDEX(G84:G100,MATCH(TRUE,E84:E100>=M63,0)),IF(O8=\"W\",INDEX(N84:N100,MATCH(TRUE,L84:L100>=M63,0)),IF(O8=\"H\",INDEX(U84:U103,MATCH(TRUE,S84:S103>=M63,0)),0)))","v":{"v":6,"d":"6.0"}},{"$f":"IF(O8=\"T\",INDEX(G84:G100,MATCH(TRUE,E84:E100>=N63,0)),IF(O8=\"W\",INDEX(N84:N100,MATCH(TRUE,L84:L100>=N63,0)),IF(O8=\"H\",INDEX(U84:U103,MATCH(TRUE,S84:S103>=N63,0)),0)))","v":{"v":6,"d":"6.0"}},"Łączniki szt./m²"]
[]
[{"$nulls":6},"m","Schemat",{"$nulls":7},"Schemat","m"]
[{"$nulls":4},{"$f":"\"Wysokość  ze = \"&TEXT('Obliczenia wiatr II'!D42,\"####0,0##\")&\" m\"","v":"Wysokość  ze = 25,0 m"},{"$f":"TEXT(K75+K76+K77,\"####0,0##\")&\" m\"","v":"28,0 m"},{"$f":"'Wyniki graficzne wiatr II'!G20","v":{"v":2,"d":"2.0"}},{"$f":"IF(O8=\"T\",INDEX(F84:F100,MATCH(TRUE,E84:E100>=I64,0)),IF(O8=\"W\",INDEX(M84:M100,MATCH(TRUE,L84:L100>=I64,0)),IF(O8=\"H\",INDEX(T84:T103,MATCH(TRUE,S84:S103>=I64,0)),0)))","v":5},{"$f":"IF(O8=\"T\",INDEX(G84:G100,MATCH(TRUE,E84:E100>=I64,0)),IF(O8=\"W\",INDEX(N84:N100,MATCH(TRUE,L84:L100>=I64,0)),IF(O8=\"H\",INDEX(U84:U103,MATCH(TRUE,S84:S103>=I64,0)),0)))","v":{"v":8,"d":"8.0"}},null,{"$f":"\"Przyjęta oś budynku, odchylona o kąt \"&TEXT('Obliczenia wiatr II'!C11,\"####0,0##\")&\"° od kierunku N\"","v":"Przyjęta oś budynku, odchylona o kąt 10,0° od kierunku N"},"Ściana I",null,null,{"$f":"IF(O8=\"T\",INDEX(G84:G100,MATCH(TRUE,E84:E100>=O64,0)),IF(O8=\"W\",INDEX(N84:N100,MATCH(TRUE,L84:L100>=O64,0)),IF(O8=\"H\",INDEX(U84:U103,MATCH(TRUE,S84:S103>=O64,0)),0)))","v":{"v":8,"d":"8.0"}},{"$f":"IF(O8=\"T\",INDEX(F84:F100,MATCH(TRUE,E84:E100>=O64,0)),IF(O8=\"W\",INDEX(M84:M100,MATCH(TRUE,L84:L100>=O64,0)),IF(O8=\"H\",INDEX(T84:T103,MATCH(TRUE,S84:S103>=O64,0)),0)))","v":5},{"$f":"'Wyniki graficzne wiatr II'!Q20","v":{"v":2,"d":"2.0"}},{"$f":"\"Wysokość  ze = \"&TEXT('Obliczenia wiatr II'!D42,\"####0,0##\")&\" m\"","v":"Wysokość  ze = 25,0 m"}]
[]
[]
[]
[{"$nulls":6},{"$f":"'Wyniki graficzne wiatr II'!G24","v":{"v":8,"d":"8.0"}},{"$f":"IF(O8=\"T\",INDEX(F84:F100,MATCH(TRUE,E84:E100>=I65,0)),IF(O8=\"W\",INDEX(M84:M100,MATCH(TRUE,L84:L100>=I65,0)),IF(O8=\"H\",INDEX(T84:T103,MATCH(TRUE,S84:S103>=I65,0)),0)))","v":3},{"$f":"IF(O8=\"T\",INDEX(G84:G100,MATCH(TRUE,E84:E100>=I65,0)),IF(O8=\"W\",INDEX(N84:N100,MATCH(TRUE,L84:L100>=I65,0)),IF(O8=\"H\",INDEX(U84:U103,MATCH(TRUE,S84:S103>=I65,0)),0)))","v":{"v":6,"d":"6.0"}},{"$nulls":5},{"$f":"IF(O8=\"T\",INDEX(G84:G100,MATCH(TRUE,E84:E100>=O65,0)),IF(O8=\"W\",INDEX(N84:N100,MATCH(TRUE,L84:L100>=O65,0)),IF(O8=\"H\",INDEX(U84:U103,MATCH(TRUE,S84:S103>=O65,0)),0)))","v":{"v":6,"d":"6.0"}},{"$f":"IF(O8=\"T\",INDEX(F84:F100,MATCH(TRUE,E84:E100>=O65,0)),IF(O8=\"W\",INDEX(M84:M100,MATCH(TRUE,L84:L100>=O65,0)),IF(O8=\"H\",INDEX(T84:T103,MATCH(TRUE,S84:S103>=O65,0)),0)))","v":3},{"$f":"'Wyniki graficzne wiatr II'!Q24","v":{"v":8,"d":"8.0"}}]
[]
[]
[]
[{"$nulls":6},{"$f":"'Wyniki graficzne wiatr II'!G28","v":{"v":8,"d":"8.0"}},{"$f":"IF(O8=\"T\",INDEX(F84:F100,MATCH(TRUE,E84:E100>=I66,0)),IF(O8=\"W\",INDEX(M84:M100,MATCH(TRUE,L84:L100>=I66,0)),IF(O8=\"H\",INDEX(T84:T103,MATCH(TRUE,S84:S103>=I66,0)),0)))","v":2},{"$f":"IF(O8=\"T\",INDEX(G84:G100,MATCH(TRUE,E84:E100>=I66,0)),IF(O8=\"W\",INDEX(N84:N100,MATCH(TRUE,L84:L100>=I66,0)),IF(O8=\"H\",INDEX(U84:U103,MATCH(TRUE,S84:S103>=I66,0)),0)))","v":{"v":5,"d":"5.0"}},{"$nulls":5},{"$f":"IF(O8=\"T\",INDEX(G84:G100,MATCH(TRUE,E84:E100>=O66,0)),IF(O8=\"W\",INDEX(N84:N100,MATCH(TRUE,L84:L100>=O66,0)),IF(O8=\"H\",INDEX(U84:U103,MATCH(TRUE,S84:S103>=O66,0)),0)))","v":{"v":5,"d":"5.0"}},{"$f":"IF(O8=\"T\",INDEX(F84:F100,MATCH(TRUE,E84:E100>=O66,0)),IF(O8=\"W\",INDEX(M84:M100,MATCH(TRUE,L84:L100>=O66,0)),IF(O8=\"H\",INDEX(T84:T103,MATCH(TRUE,S84:S103>=O66,0)),0)))","v":2},{"$f":"'Wyniki graficzne wiatr II'!Q28","v":{"v":16,"d":"16.0"}}]
[{"$nulls":9},"Ściana IV",null,"→",null,"Ściana II"]
[]
[]
[{"$nulls":6},{"$f":"'Wyniki graficzne wiatr II'!G32","v":{"v":8,"d":"8.0"}},{"$f":"IF(O8=\"T\",INDEX(F84:F100,MATCH(TRUE,E84:E100>=I67,0)),IF(O8=\"W\",INDEX(M84:M100,MATCH(TRUE,L84:L100>=I67,0)),IF(O8=\"H\",INDEX(T84:T103,MATCH(TRUE,S84:S103>=I67,0)),0)))","v":2},{"$f":"IF(O8=\"T\",INDEX(G84:G100,MATCH(TRUE,E84:E100>=I67,0)),IF(O8=\"W\",INDEX(N84:N100,MATCH(TRUE,L84:L100>=I67,0)),IF(O8=\"H\",INDEX(U84:U103,MATCH(TRUE,S84:S103>=I67,0)),0)))","v":{"v":5,"d":"5.0"}},{"$nulls":5},{"$f":"IF(O8=\"T\",INDEX(G84:G100,MATCH(TRUE,E84:E100>=O67,0)),IF(O8=\"W\",INDEX(N84:N100,MATCH(TRUE,L84:L100>=O67,0)),IF(O8=\"H\",INDEX(U84:U103,MATCH(TRUE,S84:S103>=O67,0)),0)))","v":{"v":5,"d":"5.0"}},{"$f":"IF(O8=\"T\",INDEX(F84:F100,MATCH(TRUE,E84:E100>=O67,0)),IF(O8=\"W\",INDEX(M84:M100,MATCH(TRUE,L84:L100>=O67,0)),IF(O8=\"H\",INDEX(T84:T103,MATCH(TRUE,S84:S103>=O67,0)),0)))","v":2},{"$f":"'Wyniki graficzne wiatr II'!Q32","v":""}]
[]
[]
[]
[{"$nulls":6},{"$f":"'Wyniki graficzne wiatr II'!G36","v":{"v":2,"d":"2.0"}},{"$f":"IF(O8=\"T\",INDEX(F84:F100,MATCH(TRUE,E84:E100>=I68,0)),IF(O8=\"W\",INDEX(M84:M100,MATCH(TRUE,L84:L100>=I68,0)),IF(O8=\"H\",INDEX(T84:T103,MATCH(TRUE,S84:S103>=I68,0)),0)))","v":2},{"$f":"IF(O8=\"T\",INDEX(G84:G100,MATCH(TRUE,E84:E100>=I68,0)),IF(O8=\"W\",INDEX(N84:N100,MATCH(TRUE,L84:L100>=I68,0)),IF(O8=\"H\",INDEX(U84:U103,MATCH(TRUE,S84:S103>=I68,0)),0)))","v":{"v":5,"d":"5.0"}},{"$nulls":5},{"$f":"IF(O8=\"T\",INDEX(G84:G100,MATCH(TRUE,E84:E100>=O68,0)),IF(O8=\"W\",INDEX(N84:N100,MATCH(TRUE,L84:L100>=O68,0)),IF(O8=\"H\",INDEX(U84:U103,MATCH(TRUE,S84:S103>=O68,0)),0)))","v":{"v":5,"d":"5.0"}},{"$f":"IF(O8=\"T\",INDEX(F84:F100,MATCH(TRUE,E84:E100>=O68,0)),IF(O8=\"W\",INDEX(M84:M100,MATCH(TRUE,L84:L100>=O68,0)),IF(O8=\"H\",INDEX(T84:T103,MATCH(TRUE,S84:S103>=O68,0)),0)))","v":2},{"$f":"'Wyniki graficzne wiatr II'!Q36","v":{"v":2,"d":"2.0"}}]
[]
[]
[{"$nulls":11},"Ściana III"]
[{"$nulls":8},"Łączniki szt./m²",{"$f":"IF(O8=\"T\",INDEX(G84:G100,MATCH(TRUE,E84:E100>=J69,0)),IF(O8=\"W\",INDEX(N84:N100,MATCH(TRUE,L84:L100>=J69,0)),IF(O8=\"H\",INDEX(U84:U103,MATCH(TRUE,S84:S103>=J69,0)),0)))","v":{"v":8,"d":"8.0"}},{"$f":"IF(O8=\"T\",INDEX(G84:G100,MATCH(TRUE,E84:E100>=K69,0)),IF(O8=\"W\",INDEX(N84:N100,MATCH(TRUE,L84:L100>=K69,0)),IF(O8=\"H\",INDEX(U84:U103,MATCH(TRUE,S84:S103>=K69,0)),0)))","v":{"v":8,"d":"8.0"}},{"$f":"IF(O8=\"T\",INDEX(G84:G100,MATCH(TRUE,E84:E100>=L69,0)),IF(O8=\"W\",INDEX(N84:N100,MATCH(TRUE,L84:L100>=L69,0)),IF(O8=\"H\",INDEX(U84:U103,MATCH(TRUE,S84:S103>=L69,0)),0)))","v":{"v":6,"d":"6.0"}},{"$f":"IF(O8=\"T\",INDEX(G84:G100,MATCH(TRUE,E84:E100>=M69,0)),IF(O8=\"W\",INDEX(N84:N100,MATCH(TRUE,L84:L100>=M69,0)),IF(O8=\"H\",INDEX(U84:U103,MATCH(TRUE,S84:S103>=M69,0)),0)))","v":{"v":6,"d":"6.0"}},{"$f":"IF(O8=\"T\",INDEX(G84:G100,MATCH(TRUE,E84:E100>=N69,0)),IF(O8=\"W\",INDEX(N84:N100,MATCH(TRUE,L84:L100>=N69,0)),IF(O8=\"H\",INDEX(U84:U103,MATCH(TRUE,S84:S103>=N69,0)),0)))","v":{"v":6,"d":"6.0"}}]
[]
[]
[{"$nulls":8},"Schemat",{"$f":"IF(O8=\"T\",INDEX(F84:F100,MATCH(TRUE,E84:E100>=J69,0)),IF(O8=\"W\",INDEX(M84:M100,MATCH(TRUE,L84:L100>=J69,0)),IF(O8=\"H\",INDEX(T84:T103,MATCH(TRUE,S84:S103>=J69,0)),0)))","v":5},{"$f":"IF(O8=\"T\",INDEX(F84:F100,MATCH(TRUE,E84:E100>=K69,0)),IF(O8=\"W\",INDEX(M84:M100,MATCH(TRUE,L84:L100>=K69,0)),IF(O8=\"H\",INDEX(T84:T103,MATCH(TRUE,S84:S103>=K69,0)),0)))","v":5},{"$f":"IF(O8=\"T\",INDEX(F84:F100,MATCH(TRUE,E84:E100>=L69,0)),IF(O8=\"W\",INDEX(M84:M100,MATCH(TRUE,L84:L100>=L69,0)),IF(O8=\"H\",INDEX(T84:T103,MATCH(TRUE,S84:S103>=L69,0)),0)))","v":3},{"$f":"IF(O8=\"T\",INDEX(F84:F100,MATCH(TRUE,E84:E100>=M69,0)),IF(O8=\"W\",INDEX(M84:M100,MATCH(TRUE,L84:L100>=M69,0)),IF(O8=\"H\",INDEX(T84:T103,MATCH(TRUE,S84:S103>=M69,0)),0)))","v":3},{"$f":"IF(O8=\"T\",INDEX(F84:F100,MATCH(TRUE,E84:E100>=N69,0)),IF(O8=\"W\",INDEX(M84:M100,MATCH(TRUE,L84:L100>=N69,0)),IF(O8=\"H\",INDEX(T84:T103,MATCH(TRUE,S84:S103>=N69,0)),0)))","v":3}]
[]
[{"$nulls":8},"m",{"$f":"'Wyniki graficzne wiatr II'!J45","v":5.6},{"$f":"'Wyniki graficzne wiatr II'!K45","v":""},{"$f":"'Wyniki graficzne wiatr II'!L45","v":4.4},{"$f":"'Wyniki graficzne wiatr II'!M45","v":""},{"$f":"'Wyniki graficzne wiatr II'!N45","v":""}]
[]
[]
[]
[{"$nulls":9},{"$f":"TEXT(N75+N76+N77,\"####0,0##\")&\" m\"","v":"10,0 m"}]
[]
[]
[{"$nulls":9},{"$f":"\"Wysokość  ze = \"&TEXT('Obliczenia wiatr II'!E42,\"####0,0##\")&\" m\"","v":"Wysokość  ze = 25,0 m"}]
[]
[]
[]
[]
[{"$nulls":9},"Wymagana nośność"]
[]
[{"$nulls":9},{"$f":"(1-O10/100)*'Wyniki graficzne wiatr II'!J15","v":{"v":2.075084304473848,"d":"2.0751"}},{"$f":"(1-O10/100)*'Wyniki graficzne wiatr II'!K15","v":{"v":2.075084304473848,"d":"2.0751"}},{"$f":"(1-O10/100)*'Wyniki graficzne wiatr II'!L15","v":{"v":1.6304233820865948,"d":"1.6304"}},{"$f":"(1-O10/100)*'Wyniki graficzne wiatr II'!M15","v":{"v":1.6304233820865948,"d":"1.6304"}},{"$f":"(1-O10/100)*'Wyniki graficzne wiatr II'!N15","v":{"v":1.6304233820865948,"d":"1.6304"}}]
[{"$nulls":8},{"$f":"(1-O10/100)*'Wyniki graficzne wiatr II'!H20","v":{"v":2.075084304473848,"d":"2.0751"}},{"$nulls":5},{"$f":"(1-O10/100)*'Wyniki graficzne wiatr II'!O20","v":{"v":2.075084304473848,"d":"2.0751"}}]
[{"$nulls":8},{"$f":"(1-O10/100)*'Wyniki graficzne wiatr II'!H24","v":{"v":1.6304233820865948,"d":"1.6304"}},{"$nulls":5},{"$f":"(1-O10/100)*'Wyniki graficzne wiatr II'!O24","v":{"v":1.6304233820865948,"d":"1.6304"}}]
[{"$nulls":8},{"$f":"(1-O10/100)*'Wyniki graficzne wiatr II'!H28","v":{"v":0.7411015373120886,"d":"0.7411"}},{"$nulls":5},{"$f":"(1-O10/100)*'Wyniki graficzne wiatr II'!O28","v":{"v":0.8522667679089018,"d":"0.8523"}}]
[{"$nulls":8},{"$f":"(1-O10/100)*'Wyniki graficzne wiatr II'!H32","v":{"v":0.7989074572224315,"d":"0.7989"}},{"$nulls":5},{"$f":"(1-O10/100)*'Wyniki graficzne wiatr II'!O32","v":{"v":0.8522667679089018,"d":"0.8523"}}]
[{"$nulls":8},{"$f":"(1-O10/100)*'Wyniki graficzne wiatr II'!H36","v":{"v":1.0167913091921854,"d":"1.0168"}},{"$nulls":5},{"$f":"(1-O10/100)*'Wyniki graficzne wiatr II'!O36","v":{"v":1.0167913091921854,"d":"1.0168"}}]
[{"$nulls":9},{"$f":"(1-O10/100)*'Wyniki graficzne wiatr II'!J40","v":{"v":2.075084304473848,"d":"2.0751"}},{"$f":"(1-O10/100)*'Wyniki graficzne wiatr II'!K40","v":{"v":2.075084304473848,"d":"2.0751"}},{"$f":"(1-O10/100)*'Wyniki graficzne wiatr II'!L40","v":{"v":1.6304233820865948,"d":"1.6304"}},{"$f":"(1-O10/100)*'Wyniki graficzne wiatr II'!M40","v":{"v":1.6304233820865948,"d":"1.6304"}},{"$f":"(1-O10/100)*'Wyniki graficzne wiatr II'!N40","v":{"v":1.6304233820865948,"d":"1.6304"}}]
[]
[]
[{"$nulls":9},"Tablica szerokości pól ściany"]
[]
[{"$nulls":10},"Ściana IV","Ściana I","Ściana II","Ściana III"]
[{"$nulls":9},"a",{"$f":"'Obliczenia wiatr II'!D35","v":2},{"$f":"'Obliczenia wiatr II'!E35","v":5.6},{"$f":"'Obliczenia wiatr II'!F35","v":2},{"$f":"'Obliczenia wiatr II'!G35","v":5.6}]
[{"$nulls":9},"b",{"$f":"'Obliczenia wiatr II'!D36","v":8},{"$f":"'Obliczenia wiatr II'!E36","v":4.4},{"$f":"'Obliczenia wiatr II'!F36","v":8},{"$f":"'Obliczenia wiatr II'!G36","v":4.4}]
[{"$nulls":9},"c",{"$f":"'Obliczenia wiatr II'!D37","v":{"v":18,"d":"18.0"}},{"$f":"'Obliczenia wiatr II'!E37","v":{"v":0,"d":"0.0"}},{"$f":"'Obliczenia wiatr II'!F37","v":{"v":18,"d":"18.0"}},{"$f":"'Obliczenia wiatr II'!G37","v":{"v":0,"d":"0.0"}}]
[]
[{"$nulls":9},"e (prost)",{"$f":"'Obliczenia wiatr II'!D29","v":{"v":10,"d":"10.0"}},{"$f":"'Obliczenia wiatr II'!E29","v":{"v":28,"d":"28.0"}},{"$f":"'Obliczenia wiatr II'!F29","v":{"v":10,"d":"10.0"}},{"$f":"'Obliczenia wiatr II'!G29","v":{"v":28,"d":"28.0"}}]
[]
[null,"T",{"$nulls":6},"W",{"$nulls":6},"H"]
[]
[null,"Schemat","Łączniki","Nośność","Nośność","Schemat","Łączniki",null,"Schemat","Łączniki","Nośność","Nośność","Schemat","Łączniki",null,"Schemat","Łączniki","Nośność","Nośność","Schemat","Łączniki"]
[null,1,{"$f":"'Obliczenia nośności T'!$D$13","v":{"v":4,"d":"4.00"}},{"$f":"IF($C$84<$O$9,0,'Obliczenia nośności T'!$D$29)","v":{"v":0,"d":"0.00"}},{"$f":"SMALL(D84:D100,1)","v":{"v":0,"d":"0.00"}},{"$f":"INDEX(B84:B100,MATCH(E84,D84:D100,))","v":1},{"$f":"INDEX(C84:C100,MATCH(E84,D84:D100,))","v":{"v":4,"d":"4.0"}},null,1,{"$f":"'Obliczenia nośności W'!$D$13","v":{"v":3.3333333333333335,"d":"3.33"}},{"$f":"IF($J$84<$O$9,0,'Obliczenia nośności W'!$D$29)","v":{"v":0,"d":"0.00"}},{"$f":"SMALL(K84:K100,1)","v":{"v":0,"d":"0.00"}},{"$f":"INDEX(I84:I100,MATCH(L84,K84:K100,))","v":1},{"$f":"INDEX(J84:J100,MATCH(L84,K84:K100,))","v":{"v":3.3333333333333335,"d":"3.3"}},null,1,{"$f":"'Obliczenia nośności H'!$D$27","v":{"v":4.166666666666667,"d":"4.17"}},{"$f":"IF($Q$84<$O$9,0,'Obliczenia nośności H'!$D$43)","v":{"v":0,"d":"0.00"}},{"$f":"SMALL(R84:R103,1)","v":{"v":0,"d":"0.00"}},{"$f":"INDEX(P84:P103,MATCH(S84,R84:R103,))","v":1},{"$f":"INDEX(Q84:Q103,MATCH(S84,R84:R103,))","v":{"v":4.166666666666667,"d":"4.2"}}]
[null,2,{"$f":"'Obliczenia nośności T'!$E$13","v":{"v":5,"d":"5.00"}},{"$f":"IF($C$85<$O$9,0,'Obliczenia nośności T'!$E$29)","v":1.36},{"$f":"SMALL(D84:D100,2)","v":1.36},{"$f":"INDEX(B84:B100,MATCH(E85,D84:D100,))","v":2},{"$f":"INDEX(C84:C100,MATCH(E85,D84:D100,))","v":{"v":5,"d":"5.0"}},null,2,{"$f":"'Obliczenia nośności W'!$E$13","v":{"v":4.166666666666667,"d":"4.17"}},{"$f":"IF($J$85<$O$9,0,'Obliczenia nośności W'!$E$29)","v":{"v":0,"d":"0.00"}},{"$f":"SMALL(K84:K100,2)","v":{"v":0,"d":"0.00"}},{"$f":"INDEX(I84:I100,MATCH(L85,K84:K100,))","v":1},{"$f":"INDEX(J84:J100,MATCH(L85,K84:K100,))","v":{"v":3.3333333333333335,"d":"3.3"}},null,2,{"$f":"'Obliczenia nośności H'!$E$27","v":{"v":5.208333333333334,"d":"5.21"}},{"$f":"IF($Q$85<$O$9,0,'Obliczenia nośności H'!$E$43)","v":{"v":1.484375,"d":"1.48"}},{"$f":"SMALL(R84:R103,2)","v":{"v":0,"d":"0.00"}},{"$f":"INDEX(P84:P103,MATCH(S85,R84:R103,))","v":1},{"$f":"INDEX(Q84:Q103,MATCH(S85,R84:R103,))","v":{"v":4.166666666666667,"d":"4.2"}}]
[null,3,{"$f":"'Obliczenia nośności T'!$F$13","v":{"v":6,"d":"6.00"}},{"$f":"IF($C$86<$O$9,0,'Obliczenia nośności T'!$F$29)","v":{"v":1.6800000000000002,"d":"1.68"}},{"$f":"SMALL(D84:D100,3)","v":{"v":1.6800000000000002,"d":"1.68"}},{"$f":"INDEX(B84:B100,MATCH(E86,D84:D100,))","v":3},{"$f":"INDEX(C84:C100,MATCH(E86,D84:D100,))","v":{"v":6,"d":"6.0"}},null,3,{"$f":"'Obliczenia nośności W'!$F$13","v":{"v":5,"d":"5.00"}},{"$f":"IF($J$86<$O$9,0,'Obliczenia nośności W'!$F$29)","v":{"v":0.925,"d":"0.93"}},{"$f":"SMALL(K84:K100,3)","v":{"v":0,"d":"0.00"}},{"$f":"INDEX(I84:I100,MATCH(L86,K84:K100,))","v":1},{"$f":"INDEX(J84:J100,MATCH(L86,K84:K100,))","v":{"v":3.3333333333333335,"d":"3.3"}},null,3,{"$f":"'Obliczenia nośności H'!$F$27","v":6.25},{"$f":"IF($Q$86<$O$9,0,'Obliczenia nośności H'!$F$43)","v":{"v":1.78125,"d":"1.78"}},{"$f":"SMALL(R84:R103,3)","v":{"v":1.484375,"d":"1.48"}},{"$f":"INDEX(P84:P103,MATCH(S86,R84:R103,))","v":2},{"$f":"INDEX(Q84:Q103,MATCH(S86,R84:R103,))","v":{"v":5.208333333333334,"d":"5.2"}}]
[null,4,{"$f":"'Obliczenia nośności T'!$G$13","v":{"v":7,"d":"7.00"}},{"$f":"IF($C$87<$O$9,0,'Obliczenia nośności T'!$G$29)","v":{"v":2,"d":"2.00"}},{"$f":"SMALL(D84:D100,4)","v":{"v":2,"d":"2.00"}},{"$f":"INDEX(B84:B100,MATCH(E87,D84:D100,))","v":4},{"$f":"INDEX(C84:C100,MATCH(E87,D84:D100,))","v":{"v":7,"d":"7.0"}},null,4,{"$f":"'Obliczenia nośności W'!$G$13","v":{"v":5.833333333333334,"d":"5.83"}},{"$f":"IF($J$87<$O$9,0,'Obliczenia nośności W'!$G$29)","v":{"v":1.0791666666666668,"d":"1.08"}},{"$f":"SMALL(K84:K100,4)","v":{"v":0.925,"d":"0.93"}},{"$f":"INDEX(I84:I100,MATCH(L87,K84:K100,))","v":3},{"$f":"INDEX(J84:J100,MATCH(L87,K84:K100,))","v":{"v":5,"d":"5.0"}},null,4,{"$f":"'Obliczenia nośności H'!$G$27","v":{"v":7.291666666666667,"d":"7.29"}},{"$f":"IF($Q$87<$O$9,0,'Obliczenia nośności H'!$G$43)","v":{"v":2.078125,"d":"2.08"}},{"$f":"SMALL(R84:R103,4)","v":{"v":1.7812499999999998,"d":"1.78"}},{"$f":"INDEX(P84:P103,MATCH(S87,R84:R103,))","v":14},{"$f":"INDEX(Q84:Q103,MATCH(S87,R84:R103,))","v":{"v":6.25,"d":"6.3"}}]
[null,5,{"$f":"'Obliczenia nośności T'!$H$13","v":{"v":8,"d":"8.00"}},{"$f":"IF($C$88<$O$9,0,'Obliczenia nośności T'!$H$29)","v":{"v":2.3200000000000003,"d":"2.32"}},{"$f":"SMALL(D84:D100,5)","v":{"v":2.3200000000000003,"d":"2.32"}},{"$f":"INDEX(B84:B100,MATCH(E88,D84:D100,))","v":5},{"$f":"INDEX(C84:C100,MATCH(E88,D84:D100,))","v":{"v":8,"d":"8.0"}},null,5,{"$f":"'Obliczenia nośności W'!$H$13","v":{"v":6.666666666666667,"d":"6.67"}},{"$f":"IF($J$88<$O$9,0,'Obliczenia nośności W'!$H$29)","v":{"v":1.2333333333333334,"d":"1.23"}},{"$f":"SMALL(K84:K100,5)","v":{"v":1.0791666666666668,"d":"1.08"}},{"$f":"INDEX(I84:I100,MATCH(L88,K84:K100,))","v":4},{"$f":"INDEX(J84:J100,MATCH(L88,K84:K100,))","v":{"v":5.833333333333334,"d":"5.8"}},null,5,{"$f":"'Obliczenia nośności H'!$H$27","v":{"v":8.333333333333334,"d":"8.33"}},{"$f":"IF($Q$88<$O$9,0,'Obliczenia nośności H'!$H$43)","v":{"v":2.375,"d":"2.38"}},{"$f":"SMALL(R84:R103,5)","v":{"v":1.78125,"d":"1.78"}},{"$f":"INDEX(P84:P103,MATCH(S88,R84:R103,))","v":3},{"$f":"INDEX(Q84:Q103,MATCH(S88,R84:R103,))","v":{"v":6.25,"d":"6.3"}}]
[null,6,{"$f":"'Obliczenia nośności T'!$I$13","v":{"v":9,"d":"9.00"}},{"$f":"IF($C$89<$O$9,0,'Obliczenia nośności T'!$I$29)","v":2.64},{"$f":"SMALL(D84:D100,6)","v":2.64},{"$f":"INDEX(B84:B100,MATCH(E89,D84:D100,))","v":6},{"$f":"INDEX(C84:C100,MATCH(E89,D84:D100,))","v":{"v":9,"d":"9.0"}},null,6,{"$f":"'Obliczenia nośności W'!$I$13","v":{"v":7.5,"d":"7.50"}},{"$f":"IF($J$89<$O$9,0,'Obliczenia nośności W'!$I$29)","v":{"v":1.3875,"d":"1.39"}},{"$f":"SMALL(K84:K100,6)","v":{"v":1.2333333333333334,"d":"1.23"}},{"$f":"INDEX(I84:I100,MATCH(L89,K84:K100,))","v":5},{"$f":"INDEX(J84:J100,MATCH(L89,K84:K100,))","v":{"v":6.666666666666667,"d":"6.7"}},null,6,{"$f":"'Obliczenia nośności H'!$I$27","v":{"v":9.375,"d":"9.38"}},{"$f":"IF($Q$89<$O$9,0,'Obliczenia nośności H'!$I$43)","v":{"v":2.671875,"d":"2.67"}},{"$f":"SMALL(R84:R103,6)","v":{"v":2.078125,"d":"2.08"}},{"$f":"INDEX(P84:P103,MATCH(S89,R84:R103,))","v":4},{"$f":"INDEX(Q84:Q103,MATCH(S89,R84:R103,))","v":{"v":7.291666666666667,"d":"7.3"}}]
[null,7,{"$f":"'Obliczenia nośności T'!$J$13","v":{"v":10,"d":"10.00"}},{"$f":"IF($C$90<$O$9,0,'Obliczenia nośności T'!$J$29)","v":2.96},{"$f":"SMALL(D84:D100,7)","v":2.84},{"$f":"INDEX(B84:B100,MATCH(E90,D84:D100,))","v":17},{"$f":"INDEX(C84:C100,MATCH(E90,D84:D100,))","v":{"v":10,"d":"10.0"}},null,7,{"$f":"'Obliczenia nośności W'!$J$13","v":{"v":8.333333333333334,"d":"8.33"}},{"$f":"IF($J$90<$O$9,0,'Obliczenia nośności W'!$J$29)","v":{"v":1.5416666666666667,"d":"1.54"}},{"$f":"SMALL(K84:K100,7)","v":{"v":1.3875,"d":"1.39"}},{"$f":"INDEX(I84:I100,MATCH(L90,K84:K100,))","v":6},{"$f":"INDEX(J84:J100,MATCH(L90,K84:K100,))","v":7.5},null,7,{"$f":"'Obliczenia nośności H'!$J$27","v":{"v":10.416666666666668,"d":"10.42"}},{"$f":"IF($Q$90<$O$9,0,'Obliczenia nośności H'!$J$43)","v":{"v":2.96875,"d":"2.97"}},{"$f":"SMALL(R84:R103,7)","v":{"v":2.375,"d":"2.38"}},{"$f":"INDEX(P84:P103,MATCH(S90,R84:R103,))","v":5},{"$f":"INDEX(Q84:Q103,MATCH(S90,R84:R103,))","v":{"v":8.333333333333334,"d":"8.3"}}]
[null,8,{"$f":"'Obliczenia nośności T'!$K$13","v":{"v":11,"d":"11.00"}},{"$f":"IF($C$91<$O$9,0,'Obliczenia nośności T'!$K$29)","v":{"v":3.2800000000000002,"d":"3.28"}},{"$f":"SMALL(D84:D100,8)","v":2.96},{"$f":"INDEX(B84:B100,MATCH(E91,D84:D100,))","v":7},{"$f":"INDEX(C84:C100,MATCH(E91,D84:D100,))","v":{"v":10,"d":"10.0"}},null,8,{"$f":"'Obliczenia nośności W'!$K$13","v":{"v":9.166666666666668,"d":"9.17"}},{"$f":"IF($J$91<$O$9,0,'Obliczenia nośności W'!$K$29)","v":{"v":1.6958333333333335,"d":"1.70"}},{"$f":"SMALL(K84:K100,8)","v":{"v":1.5416666666666667,"d":"1.54"}},{"$f":"INDEX(I84:I100,MATCH(L91,K84:K100,))","v":7},{"$f":"INDEX(J84:J100,MATCH(L91,K84:K100,))","v":{"v":8.333333333333334,"d":"8.3"}},null,8,{"$f":"'Obliczenia nośności H'!$K$27","v":{"v":11.458333333333334,"d":"11.46"}},{"$f":"IF($Q$91<$O$9,0,'Obliczenia nośności H'!$K$43)","v":{"v":3.265625,"d":"3.27"}},{"$f":"SMALL(R84:R103,8)","v":{"v":2.375,"d":"2.38"}},{"$f":"INDEX(P84:P103,MATCH(S91,R84:R103,))","v":5},{"$f":"INDEX(Q84:Q103,MATCH(S91,R84:R103,))","v":{"v":8.333333333333334,"d":"8.3"}}]
[null,9,{"$f":"'Obliczenia nośności T'!$L$13","v":{"v":12,"d":"12.00"}},{"$f":"IF($C$92<$O$9,0,'Obliczenia nośności T'!$L$29)","v":{"v":3.6,"d":"3.60"}},{"$f":"SMALL(D84:D100,9)","v":{"v":3.2800000000000002,"d":"3.28"}},{"$f":"INDEX(B84:B100,MATCH(E92,D84:D100,))","v":8},{"$f":"INDEX(C84:C100,MATCH(E92,D84:D100,))","v":{"v":11,"d":"11.0"}},null,9,{"$f":"'Obliczenia nośności W'!$L$13","v":{"v":10,"d":"10.00"}},{"$f":"IF($J$92<$O$9,0,'Obliczenia nośności W'!$L$29)","v":1.85},{"$f":"SMALL(K84:K100,9)","v":{"v":1.6958333333333335,"d":"1.70"}},{"$f":"INDEX(I84:I100,MATCH(L92,K84:K100,))","v":8},{"$f":"INDEX(J84:J100,MATCH(L92,K84:K100,))","v":{"v":9.166666666666668,"d":"9.2"}},null,9,{"$f":"'Obliczenia nośności H'!$L$27","v":{"v":12.5,"d":"12.50"}},{"$f":"IF($Q$92<$O$9,0,'Obliczenia nośności H'!$L$43)","v":{"v":3.5625,"d":"3.56"}},{"$f":"SMALL(R84:R103,9)","v":{"v":2.671875,"d":"2.67"}},{"$f":"INDEX(P84:P103,MATCH(S92,R84:R103,))","v":6},{"$f":"INDEX(Q84:Q103,MATCH(S92,R84:R103,))","v":{"v":9.375,"d":"9.4"}}]
[null,10,{"$f":"'Obliczenia nośności T'!$M$13","v":{"v":12,"d":"12.00"}},{"$f":"IF($C$93<$O$9,0,'Obliczenia nośności T'!$M$29)","v":3.48},{"$f":"SMALL(D84:D100,10)","v":3.48},{"$f":"INDEX(B84:B100,MATCH(E93,D84:D100,))","v":10},{"$f":"INDEX(C84:C100,MATCH(E93,D84:D100,))","v":{"v":12,"d":"12.0"}},null,10,{"$f":"'Obliczenia nośności W'!$M$13","v":{"v":10.833333333333334,"d":"10.83"}},{"$f":"IF($J$93<$O$9,0,'Obliczenia nośności W'!$M$29)","v":{"v":2.0208333333333335,"d":"2.02"}},{"$f":"SMALL(K84:K100,10)","v":1.85},{"$f":"INDEX(I84:I100,MATCH(L93,K84:K100,))","v":9},{"$f":"INDEX(J84:J100,MATCH(L93,K84:K100,))","v":{"v":10,"d":"10.0"}},null,10,{"$f":"'Obliczenia nośności H'!$M$27","v":{"v":13.541666666666668,"d":"13.54"}},{"$f":"IF($Q$93<$O$9,0,'Obliczenia nośności H'!$M$43)","v":{"v":3.8593749999999996,"d":"3.86"}},{"$f":"SMALL(R84:R103,10)","v":{"v":2.96875,"d":"2.97"}},{"$f":"INDEX(P84:P103,MATCH(S93,R84:R103,))","v":7},{"$f":"INDEX(Q84:Q103,MATCH(S93,R84:R103,))","v":{"v":10.416666666666668,"d":"10.4"}}]
[null,11,{"$f":"'Obliczenia nośności T'!$N$13","v":{"v":13,"d":"13.00"}},{"$f":"IF($C$94<$O$9,0,'Obliczenia nośności T'!$N$29)","v":3.92},{"$f":"SMALL(D84:D100,11)","v":{"v":3.6,"d":"3.60"}},{"$f":"INDEX(B84:B100,MATCH(E94,D84:D100,))","v":9},{"$f":"INDEX(C84:C100,MATCH(E94,D84:D100,))","v":{"v":12,"d":"12.0"}},null,11,{"$f":"'Obliczenia nośności W'!$N$13","v":{"v":11.666666666666668,"d":"11.67"}},{"$f":"IF($J$94<$O$9,0,'Obliczenia nośności W'!$N$29)","v":{"v":2.191666666666667,"d":"2.19"}},{"$f":"SMALL(K84:K100,11)","v":{"v":2.0208333333333335,"d":"2.02"}},{"$f":"INDEX(I84:I100,MATCH(L94,K84:K100,))","v":10},{"$f":"INDEX(J84:J100,MATCH(L94,K84:K100,))","v":{"v":10.833333333333334,"d":"10.8"}},null,11,{"$f":"'Obliczenia nośności H'!$N$27","v":{"v":14.583333333333334,"d":"14.58"}},{"$f":"IF($Q$94<$O$9,0,'Obliczenia nośności H'!$N$43)","v":{"v":4.15625,"d":"4.16"}},{"$f":"SMALL(R84:R103,11)","v":{"v":2.96875,"d":"2.97"}},{"$f":"INDEX(P84:P103,MATCH(S94,R84:R103,))","v":7},{"$f":"INDEX(Q84:Q103,MATCH(S94,R84:R103,))","v":{"v":10.416666666666668,"d":"10.4"}}]
[null,12,{"$f":"'Obliczenia nośności T'!$O$13","v":{"v":13,"d":"13.00"}},{"$f":"IF($C$95<$O$9,0,'Obliczenia nośności T'!$O$29)","v":{"v":3.8000000000000003,"d":"3.80"}},{"$f":"SMALL(D84:D100,12)","v":{"v":3.8000000000000003,"d":"3.80"}},{"$f":"INDEX(B84:B100,MATCH(E95,D84:D100,))","v":12},{"$f":"INDEX(C84:C100,MATCH(E95,D84:D100,))","v":{"v":13,"d":"13.0"}},null,12,{"$f":"'Obliczenia nośności W'!$O$13","v":{"v":12.5,"d":"12.50"}},{"$f":"IF($J$95<$O$9,0,'Obliczenia nośności W'!$O$29)","v":{"v":2.3625,"d":"2.36"}},{"$f":"SMALL(K84:K100,12)","v":{"v":2.191666666666667,"d":"2.19"}},{"$f":"INDEX(I84:I100,MATCH(L95,K84:K100,))","v":11},{"$f":"INDEX(J84:J100,MATCH(L95,K84:K100,))","v":{"v":11.666666666666668,"d":"11.7"}},null,12,{"$f":"'Obliczenia nośności H'!$O$27","v":{"v":15.625,"d":"15.63"}},{"$f":"IF($Q$95<$O$9,0,'Obliczenia nośności H'!$O$43)","v":{"v":4.453125,"d":"4.45"}},{"$f":"SMALL(R84:R103,12)","v":{"v":3.265625,"d":"3.27"}},{"$f":"INDEX(P84:P103,MATCH(S95,R84:R103,))","v":8},{"$f":"INDEX(Q84:Q103,MATCH(S95,R84:R103,))","v":{"v":11.458333333333334,"d":"11.5"}}]
[null,13,{"$f":"'Obliczenia nośności T'!$P$13","v":{"v":14,"d":"14.00"}},{"$f":"IF($C$96<$O$9,0,'Obliczenia nośności T'!$P$29)","v":4.24},{"$f":"SMALL(D84:D100,13)","v":3.92},{"$f":"INDEX(B84:B100,MATCH(E96,D84:D100,))","v":11},{"$f":"INDEX(C84:C100,MATCH(E96,D84:D100,))","v":{"v":13,"d":"13.0"}},null,13,{"$f":"'Obliczenia nośności W'!$P$13","v":{"v":13.333333333333334,"d":"13.33"}},{"$f":"IF($J$96<$O$9,0,'Obliczenia nośności W'!$P$29)","v":{"v":2.533333333333333,"d":"2.53"}},{"$f":"SMALL(K84:K100,13)","v":{"v":2.3625,"d":"2.36"}},{"$f":"INDEX(I84:I100,MATCH(L96,K84:K100,))","v":12},{"$f":"INDEX(J84:J100,MATCH(L96,K84:K100,))","v":12.5},null,13,{"$f":"'Obliczenia nośności H'!$P$27","v":{"v":4.166666666666667,"d":"4.17"}},{"$f":"IF($Q$96<$O$9,0,'Obliczenia nośności H'!$P$43)","v":{"v":0,"d":"0.00"}},{"$f":"SMALL(R84:R103,13)","v":{"v":3.5624999999999996,"d":"3.56"}},{"$f":"INDEX(P84:P103,MATCH(S96,R84:R103,))","v":17},{"$f":"INDEX(Q84:Q103,MATCH(S96,R84:R103,))","v":12.5}]
[null,14,{"$f":"'Obliczenia nośności T'!$Q$13","v":{"v":14,"d":"14.00"}},{"$f":"IF($C$97<$O$9,0,'Obliczenia nośności T'!$Q$29)","v":4.12},{"$f":"SMALL(D84:D100,14)","v":4.12},{"$f":"INDEX(B84:B100,MATCH(E97,D84:D100,))","v":14},{"$f":"INDEX(C84:C100,MATCH(E97,D84:D100,))","v":{"v":14,"d":"14.0"}},null,14,{"$f":"'Obliczenia nośności W'!$Q$13","v":{"v":3.3333333333333335,"d":"3.33"}},{"$f":"IF($J$97<$O$9,0,'Obliczenia nośności W'!$Q$29)","v":{"v":0,"d":"0.00"}},{"$f":"SMALL(K84:K100,14)","v":{"v":2.533333333333333,"d":"2.53"}},{"$f":"INDEX(I84:I100,MATCH(L97,K84:K100,))","v":13},{"$f":"INDEX(J84:J100,MATCH(L97,K84:K100,))","v":{"v":13.333333333333334,"d":"13.3"}},null,14,{"$f":"'Obliczenia nośności H'!$Q$27","v":6.25},{"$f":"IF($Q$97<$O$9,0,'Obliczenia nośności H'!$Q$43)","v":{"v":1.7812499999999998,"d":"1.78"}},{"$f":"SMALL(R84:R103,14)","v":{"v":3.5625,"d":"3.56"}},{"$f":"INDEX(P84:P103,MATCH(S97,R84:R103,))","v":9},{"$f":"INDEX(Q84:Q103,MATCH(S97,R84:R103,))","v":12.5}]
[null,15,{"$f":"'Obliczenia nośności T'!$R$13","v":{"v":15,"d":"15.00"}},{"$f":"IF($C$98<$O$9,0,'Obliczenia nośności T'!$R$29)","v":{"v":4.4399999999999995,"d":"4.44"}},{"$f":"SMALL(D84:D100,15)","v":4.24},{"$f":"INDEX(B84:B100,MATCH(E98,D84:D100,))","v":13},{"$f":"INDEX(C84:C100,MATCH(E98,D84:D100,))","v":{"v":14,"d":"14.0"}},{"$nulls":8},15,{"$f":"'Obliczenia nośności H'!$R$27","v":{"v":8.333333333333334,"d":"8.33"}},{"$f":"IF($Q$98<$O$9,0,'Obliczenia nośności H'!$R$43)","v":{"v":2.375,"d":"2.38"}},{"$f":"SMALL(R84:R103,15)","v":{"v":3.8593749999999996,"d":"3.86"}},{"$f":"INDEX(P84:P103,MATCH(S98,R84:R103,))","v":10},{"$f":"INDEX(Q84:Q103,MATCH(S98,R84:R103,))","v":{"v":13.541666666666668,"d":"13.5"}}]
[null,16,{"$f":"'Obliczenia nośności T'!$S$13","v":{"v":16,"d":"16.00"}},{"$f":"IF($C$99<$O$9,0,'Obliczenia nośności T'!$S$29)","v":4.76},{"$f":"SMALL(D84:D100,16)","v":{"v":4.4399999999999995,"d":"4.44"}},{"$f":"INDEX(B84:B100,MATCH(E99,D84:D100,))","v":15},{"$f":"INDEX(C84:C100,MATCH(E99,D84:D100,))","v":{"v":15,"d":"15.0"}},{"$nulls":8},16,{"$f":"'Obliczenia nośności H'!$S$27","v":{"v":10.416666666666668,"d":"10.42"}},{"$f":"IF($Q$99<$O$9,0,'Obliczenia nośności H'!$S$43)","v":{"v":2.96875,"d":"2.97"}},{"$f":"SMALL(R84:R103,16)","v":{"v":4.15625,"d":"4.16"}},{"$f":"INDEX(P84:P103,MATCH(S99,R84:R103,))","v":11},{"$f":"INDEX(Q84:Q103,MATCH(S99,R84:R103,))","v":{"v":14.583333333333334,"d":"14.6"}}]
[null,17,{"$f":"'Obliczenia nośności T'!$T$13","v":{"v":10,"d":"10.00"}},{"$f":"IF($C$100<$O$9,0,'Obliczenia nośności T'!$T$29)","v":2.84},{"$f":"SMALL(D84:D100,17)","v":4.76},{"$f":"INDEX(B84:B100,MATCH(E100,D84:D100,))","v":16},{"$f":"INDEX(C84:C100,MATCH(E100,D84:D100,))","v":{"v":16,"d":"16.0"}},{"$nulls":8},17,{"$f":"'Obliczenia nośności H'!$T$27","v":{"v":12.5,"d":"12.50"}},{"$f":"IF($Q$100<$O$9,0,'Obliczenia nośności H'!$T$43)","v":{"v":3.5624999999999996,"d":"3.56"}},{"$f":"SMALL(R84:R103,17)","v":{"v":4.15625,"d":"4.16"}},{"$f":"INDEX(P84:P103,MATCH(S100,R84:R103,))","v":11},{"$f":"INDEX(Q84:Q103,MATCH(S100,R84:R103,))","v":{"v":14.583333333333334,"d":"14.6"}}]
[{"$nulls":15},18,{"$f":"'Obliczenia nośności H'!$U$27","v":{"v":14.583333333333334,"d":"14.58"}},{"$f":"IF($Q$101<$O$9,0,'Obliczenia nośności H'!$U$43)","v":{"v":4.15625,"d":"4.16"}},{"$f":"SMALL(R84:R103,18)","v":{"v":4.453125,"d":"4.45"}},{"$f":"INDEX(P84:P103,MATCH(S101,R84:R103,))","v":12},{"$f":"INDEX(Q84:Q103,MATCH(S101,R84:R103,))","v":{"v":15.625,"d":"15.6"}}]
[{"$nulls":15},19,{"$f":"'Obliczenia nośności H'!$V$27","v":{"v":16.666666666666668,"d":"16.67"}},{"$f":"IF($Q$102<$O$9,0,'Obliczenia nośności H'!$V$43)","v":4.75},{"$f":"SMALL(R84:R103,19)","v":4.75},{"$f":"INDEX(P84:P103,MATCH(S102,R84:R103,))","v":19},{"$f":"INDEX(Q84:Q103,MATCH(S102,R84:R103,))","v":{"v":16.666666666666668,"d":"16.7"}}]
[{"$nulls":15},20,{"$f":"'Obliczenia nośności H'!$W$27","v":{"v":20.833333333333336,"d":"20.83"}},{"$f":"IF($Q$103<$O$9,0,'Obliczenia nośności H'!$W$43)","v":{"v":5.9375,"d":"5.94"}},{"$f":"SMALL(R84:R103,20)","v":{"v":5.9375,"d":"5.94"}},{"$f":"INDEX(P84:P103,MATCH(S103,R84:R103,))","v":20},{"$f":"INDEX(Q84:Q103,MATCH(S103,R84:R103,))","v":{"v":20.833333333333336,"d":"20.8"}}]
[{"$nulls":11},"Schematy"]
[{"$nulls":11},"T"]
[{"$nulls":11},"W"]
[{"$nulls":11},"H"]

{"sheet":"Przemieszczenia wiatr I","index":11,"n_rows":79,"n_cols":18,"rows_kept":79,"merged":[[1,1,2,21],[3,1,3,21],[5,1,5,21],[7,7,7,14],[8,7,8,14],[9,7,9,14],[11,9,13,13],[14,8,17,8],[14,9,17,9],[14,10,17,10],[14,11,17,11],[14,12,17,12],[14,13,17,13],[18,8,19,8],[18,9,19,9],[18,10,19,10],[18,11,19,11],[18,12,19,12],[18,13,19,13],[18,14,19,14],[20,8,22,8],[20,9,22,9],[20,10,22,10],[20,11,22,11],[20,12,22,12],[20,13,22,13],[20,14,22,14],[23,4,42,4],[23,5,42,5],[23,6,26,6],[23,7,26,7],[23,8,26,8],[23,14,26,14],[23,15,26,15],[23,16,26,16],[23,17,42,17],[24,9,25,9],[24,10,41,10],[27,6,30,6],[27,7,30,7],[27,8,30,8],[27,14,30,14],[27,15,30,15],[27,16,30,16],[28,9,29,9],[31,6,34,6],[31,7,34,7],[31,8,34,8],[31,14,34,14],[31,15,34,15],[31,16,34,16],[32,9,33,9],[32,11,33,11],[32,13,33,13],[35,6,38,6],[35,7,38,7],[35,8,38,8],[35,14,38,14],[35,15,38,15],[35,16,38,16],[36,9,37,9],[39,6,42,6],[39,7,42,7],[39,8,42,8],[39,14,42,14],[39,15,42,15],[39,16,42,16],[40,9,41,9],[43,8,45,8],[43,9,45,9],[43,10,45,10],[43,11,45,11],[43,12,45,12],[43,13,45,13],[46,8,47,8],[46,9,47,9],[46,10,47,10],[46,11,47,11],[46,12,47,12],[46,13,47,13],[48,8,51,8],[48,9,51,9],[48,10,51,10],[48,11,51,11],[48,12,51,12],[48,13,51,13],[52,9,54,13],[55,9,57,13],[60,9,60,13],[71,9,71,13]]}
[]
[null,"Określenie przemieszczenia δN w miejscu występowania łącznika, przy działaniu wiatru  I"]
[]
[null,"Wiatr I - takie same warunki ze wszystkich kierunków"]
[]
[null,"UWAGA! Wymiary rzutu budynku i szerokości pól ściany nie są pokazywane w skali."]
[]
[{"$nulls":7},"Przemieszczenie wg ETA, δm, mm",{"$nulls":7},{"v":0.8,"d":"0.80"}]
[{"$nulls":7},"Siła wyrywająca wg ETA, N, kN",{"$nulls":7},{"v":0.4,"d":"0.40"}]
[{"$nulls":7},"Przemieszczenie graniczne δ (w miejscu występowania łącznika), mm",{"$nulls":7},0.333]
[]
[{"$nulls":9},{"$f":"\"Wysokość  ze = \"&TEXT('Obliczenia wiatr I'!D46,\"####0,0##\")&\" m\"","v":"Wysokość  ze = 25,0 m"}]
[]
[]
[{"$nulls":8},"m",{"$f":"'Wyniki graficzne wiatr I'!J11","v":""},{"$f":"'Wyniki graficzne wiatr I'!K11","v":""},{"$f":"'Wyniki graficzne wiatr I'!L11","v":""},{"$f":"'Wyniki graficzne wiatr I'!M11","v":""},{"$f":"'Wyniki graficzne wiatr I'!N11","v":{"v":10,"d":"10.0"}}]
[]
[]
[]
[{"$nulls":8},"δN          mm",{"$f":"$P$8*J63/'Łączniki wiatr I'!J21/$P$9","v":{"v":0.35654369492677795,"d":"0.357"}},{"$f":"$P$8*K63/'Łączniki wiatr I'!K21/$P$9","v":{"v":0.35654369492677795,"d":"0.357"}},{"$f":"$P$8*L63/'Łączniki wiatr I'!L21/$P$9","v":{"v":0.35654369492677795,"d":"0.357"}},{"$f":"$P$8*M63/'Łączniki wiatr I'!M21/$P$9","v":{"v":0.35654369492677795,"d":"0.357"}},{"$f":"$P$8*N63/'Łączniki wiatr I'!N21/$P$9","v":{"v":0.35654369492677795,"d":"0.357"}},"δN          mm"]
[]
[{"$nulls":8},"Łączniki min. szt./m²",{"$f":"$P$8*J63/($P$9*$P$10)","v":{"v":8.565614292535207,"d":"8.6"}},{"$f":"$P$8*K63/($P$9*$P$10)","v":{"v":8.565614292535207,"d":"8.6"}},{"v":8.565614292535207,"d":"8.6"},{"v":8.565614292535207,"d":"8.6"},{"v":8.565614292535207,"d":"8.6"},"Łączniki min. szt./m²"]
[]
[{"$nulls":6},"m","δN, mm",{"$nulls":7},"δN, mm","m"]
[{"$nulls":4},{"$f":"\"Wysokość  ze = \"&TEXT('Obliczenia wiatr I'!C46,\"####0,0##\")&\" m\"","v":"Wysokość  ze = 25,0 m"},{"$f":"TEXT(K75+K76+K77,\"####0,0##\")&\" m\"","v":"28,0 m"},{"$f":"'Wyniki graficzne wiatr I'!G20","v":{"v":2,"d":"2.0"}},{"$f":"$P$8*I64/'Łączniki wiatr I'!I24/$P$9","v":{"v":0.35654369492677795,"d":"0.357"}},{"$f":"$P$8*I64/($P$9*$P$10)","v":{"v":8.565614292535207,"d":"8.6"}},null,null,"Ściana I",null,null,{"$f":"$P$8*O64/($P$9*$P$10)","v":{"v":8.565614292535207,"d":"8.6"}},{"$f":"$P$8*O64/'Łączniki wiatr I'!O24/$P$9","v":{"v":0.35654369492677795,"d":"0.357"}},{"$f":"'Wyniki graficzne wiatr I'!Q20","v":{"v":2,"d":"2.0"}},{"$f":"\"Wysokość  ze = \"&TEXT('Obliczenia wiatr I'!C46,\"####0,0##\")&\" m\"","v":"Wysokość  ze = 25,0 m"}]
[]
[]
[]
[{"$nulls":6},{"$f":"'Wyniki graficzne wiatr I'!G24","v":{"v":8,"d":"8.0"}},{"$f":"$P$8*I65/'Łączniki wiatr I'!I28/$P$9","v":{"v":0.3735219661137674,"d":"0.374"}},{"$f":"$P$8*I65/($P$9*$P$10)","v":{"v":6.730125515563377,"d":"6.7"}},{"$nulls":5},{"$f":"$P$8*O65/($P$9*$P$10)","v":{"v":6.730125515563377,"d":"6.7"}},{"$f":"$P$8*O65/'Łączniki wiatr I'!O28/$P$9","v":{"v":0.3735219661137674,"d":"0.374"}},{"$f":"'Wyniki graficzne wiatr I'!Q24","v":{"v":8,"d":"8.0"}}]
[]
[]
[]
[{"$nulls":6},{"$f":"'Wyniki graficzne wiatr I'!G28","v":{"v":8,"d":"8.0"}},{"$f":"$P$8*I66/'Łączniki wiatr I'!I32/$P$9","v":{"v":0.23430014238045407,"d":"0.234"}},{"$f":"$P$8*I66/($P$9*$P$10)","v":{"v":3.518020155862674,"d":"3.5"}},{"$nulls":5},{"$f":"$P$8*O66/($P$9*$P$10)","v":{"v":3.518020155862674,"d":"3.5"}},{"$f":"$P$8*O66/'Łączniki wiatr I'!O32/$P$9","v":{"v":0.23430014238045407,"d":"0.234"}},{"$f":"'Wyniki graficzne wiatr I'!Q28","v":{"v":8,"d":"8.0"}}]
[{"$nulls":9},"Ściana IV",{"$nulls":3},"Ściana II"]
[]
[]
[{"$nulls":6},{"$f":"'Wyniki graficzne wiatr I'!G32","v":{"v":8,"d":"8.0"}},{"$f":"$P$8*I67/'Łączniki wiatr I'!I36/$P$9","v":{"v":0.3735219661137674,"d":"0.374"}},{"$f":"$P$8*I67/($P$9*$P$10)","v":{"v":6.730125515563377,"d":"6.7"}},{"$nulls":5},{"$f":"$P$8*O67/($P$9*$P$10)","v":{"v":6.730125515563377,"d":"6.7"}},{"$f":"$P$8*O67/'Łączniki wiatr I'!O36/$P$9","v":{"v":0.3735219661137674,"d":"0.374"}},{"$f":"'Wyniki graficzne wiatr I'!Q32","v":{"v":8,"d":"8.0"}}]
[]
[]
[]
[{"$nulls":6},{"$f":"'Wyniki graficzne wiatr I'!G36","v":{"v":2,"d":"2.0"}},{"$f":"$P$8*I68/'Łączniki wiatr I'!I40/$P$9","v":{"v":0.35654369492677795,"d":"0.357"}},{"$f":"$P$8*I68/($P$9*$P$10)","v":{"v":8.565614292535207,"d":"8.6"}},{"$nulls":5},{"$f":"$P$8*O68/($P$9*$P$10)","v":{"v":8.565614292535207,"d":"8.6"}},{"$f":"$P$8*O68/'Łączniki wiatr I'!O40/$P$9","v":{"v":0.35654369492677795,"d":"0.357"}},{"$f":"'Wyniki graficzne wiatr I'!Q36","v":{"v":2,"d":"2.0"}}]
[]
[]
[{"$nulls":11},"Ściana III"]
[{"$nulls":8},"Łączniki min. szt./m²",{"$f":"$P$8*J69/($P$9*$P$10)","v":{"v":8.565614292535207,"d":"8.6"}},{"$f":"$P$8*K69/($P$9*$P$10)","v":{"v":8.565614292535207,"d":"8.6"}},{"v":8.565614292535207,"d":"8.6"},{"v":8.565614292535207,"d":"8.6"},{"v":8.565614292535207,"d":"8.6"}]
[]
[]
[{"$nulls":8},"δN          mm",{"$f":"$P$8*J69/'Łączniki wiatr I'!J44/$P$9","v":{"v":0.35654369492677795,"d":"0.357"}},{"$f":"$P$8*K69/'Łączniki wiatr I'!K44/$P$9","v":{"v":0.35654369492677795,"d":"0.357"}},{"$f":"$P$8*L69/'Łączniki wiatr I'!L44/$P$9","v":{"v":0.35654369492677795,"d":"0.357"}},{"$f":"$P$8*M69/'Łączniki wiatr I'!M44/$P$9","v":{"v":0.35654369492677795,"d":"0.357"}},{"$f":"$P$8*N69/'Łączniki wiatr I'!N44/$P$9","v":{"v":0.35654369492677795,"d":"0.357"}}]
[]
[{"$nulls":8},"m",{"$f":"'Wyniki graficzne wiatr I'!J45","v":""},{"$f":"'Wyniki graficzne wiatr I'!K45","v":""},{"$f":"'Wyniki graficzne wiatr I'!L45","v":""},{"$f":"'Wyniki graficzne wiatr I'!M45","v":""},{"$f":"'Wyniki graficzne wiatr I'!N45","v":{"v":10,"d":"10.0"}}]
[]
[]
[]
[{"$nulls":9},{"$f":"TEXT(N75+N76+N77,\"####0,0##\")&\" m\"","v":"10,0 m"}]
[]
[]
[{"$nulls":9},{"$f":"\"Wysokość  ze = \"&TEXT('Obliczenia wiatr I'!D46,\"####0,0##\")&\" m\"","v":"Wysokość  ze = 25,0 m"}]
[]
[]
[]
[]
[{"$nulls":9},"Charakterystyczne obciążenie wiatrem"]
[]
[{"$nulls":9},{"$f":"'Wyniki graficzne wiatr I'!J15/'Obliczenia wiatr I'!C87","v":{"v":1.4261747797071118,"d":"1.4262"}},{"$f":"'Wyniki graficzne wiatr I'!K15/'Obliczenia wiatr I'!C87","v":{"v":1.4261747797071118,"d":"1.4262"}},{"$f":"'Wyniki graficzne wiatr I'!L15/'Obliczenia wiatr I'!C87","v":{"v":1.4261747797071118,"d":"1.4262"}},{"$f":"'Wyniki graficzne wiatr I'!M15/'Obliczenia wiatr I'!C87","v":{"v":1.4261747797071118,"d":"1.4262"}},{"$f":"'Wyniki graficzne wiatr I'!N15/'Obliczenia wiatr I'!C87","v":{"v":1.4261747797071118,"d":"1.4262"}}]
[{"$nulls":8},{"$f":"'Wyniki graficzne wiatr I'!H20/'Obliczenia wiatr I'!C87","v":{"v":1.4261747797071118,"d":"1.4262"}},{"$nulls":5},{"$f":"'Wyniki graficzne wiatr I'!O20/'Obliczenia wiatr I'!C87","v":{"v":1.4261747797071118,"d":"1.4262"}}]
[{"$nulls":8},{"$f":"'Wyniki graficzne wiatr I'!H24/'Obliczenia wiatr I'!C87","v":{"v":1.1205658983413023,"d":"1.1206"}},{"$nulls":5},{"$f":"'Wyniki graficzne wiatr I'!O24/'Obliczenia wiatr I'!C87","v":{"v":1.1205658983413023,"d":"1.1206"}}]
[{"$nulls":8},{"$f":"'Wyniki graficzne wiatr I'!H28/'Obliczenia wiatr I'!C87","v":{"v":0.5857503559511352,"d":"0.5858"}},{"$nulls":5},{"$f":"'Wyniki graficzne wiatr I'!O28/'Obliczenia wiatr I'!C87","v":{"v":0.5857503559511352,"d":"0.5858"}}]
[{"$nulls":8},{"$f":"'Wyniki graficzne wiatr I'!H32/'Obliczenia wiatr I'!C87","v":{"v":1.1205658983413023,"d":"1.1206"}},{"$nulls":5},{"$f":"'Wyniki graficzne wiatr I'!O32/'Obliczenia wiatr I'!C87","v":{"v":1.1205658983413023,"d":"1.1206"}}]
[{"$nulls":8},{"$f":"'Wyniki graficzne wiatr I'!H36/'Obliczenia wiatr I'!C87","v":{"v":1.4261747797071118,"d":"1.4262"}},{"$nulls":5},{"$f":"'Wyniki graficzne wiatr I'!O36/'Obliczenia wiatr I'!C87","v":{"v":1.4261747797071118,"d":"1.4262"}}]
[{"$nulls":9},{"$f":"'Wyniki graficzne wiatr I'!J40/'Obliczenia wiatr I'!C87","v":{"v":1.4261747797071118,"d":"1.4262"}},{"$f":"'Wyniki graficzne wiatr I'!K40/'Obliczenia wiatr I'!C87","v":{"v":1.4261747797071118,"d":"1.4262"}},{"$f":"'Wyniki graficzne wiatr I'!L40/'Obliczenia wiatr I'!C87","v":{"v":1.4261747797071118,"d":"1.4262"}},{"$f":"'Wyniki graficzne wiatr I'!M40/'Obliczenia wiatr I'!C87","v":{"v":1.4261747797071118,"d":"1.4262"}},{"$f":"'Wyniki graficzne wiatr I'!N40/'Obliczenia wiatr I'!C87","v":{"v":1.4261747797071118,"d":"1.4262"}}]
[]
[]
[{"$nulls":9},"Tablica szerokości pól ściany"]
[]
[{"$nulls":10},"Ściana IV","Ściana I","Ściana II","Ściana III"]
[{"$nulls":9},"a",{"$f":"'Obliczenia wiatr I'!C31","v":2},{"$f":"'Obliczenia wiatr I'!D31","v":5.6},{"$f":"'Obliczenia wiatr I'!C31","v":2},{"$f":"'Obliczenia wiatr I'!D31","v":5.6}]
[{"$nulls":9},"b",{"$f":"'Obliczenia wiatr I'!C32","v":8},{"$f":"'Obliczenia wiatr I'!D32","v":4.4},{"$f":"'Obliczenia wiatr I'!C32","v":8},{"$f":"'Obliczenia wiatr I'!D32","v":4.4}]
[{"$nulls":9},"c",{"$f":"'Obliczenia wiatr I'!C33","v":{"v":18,"d":"18.0"}},{"$f":"'Obliczenia wiatr I'!D33","v":{"v":0,"d":"0.0"}},{"$f":"'Obliczenia wiatr I'!C33","v":{"v":18,"d":"18.0"}},{"$f":"'Obliczenia wiatr I'!D33","v":{"v":0,"d":"0.0"}}]
[]
[{"$nulls":9},"e (prost)",{"$f":"'Obliczenia wiatr I'!C25","v":{"v":10,"d":"10.0"}},{"$f":"'Obliczenia wiatr I'!D25","v":{"v":28,"d":"28.0"}},{"$f":"'Obliczenia wiatr I'!C25","v":{"v":10,"d":"10.0"}},{"$f":"'Obliczenia wiatr I'!D25","v":{"v":28,"d":"28.0"}}]

{"sheet":"Przemieszczenia wiatr II","index":12,"n_rows":79,"n_cols":18,"rows_kept":79,"merged":[[1,1,2,21],[3,1,3,21],[5,1,5,21],[7,7,7,14],[8,7,8,14],[9,7,9,14],[11,9,13,13],[14,8,17,8],[14,9,17,9],[14,10,17,10],[14,11,17,11],[14,12,17,12],[14,13,17,13],[18,8,19,8],[18,9,19,9],[18,10,19,10],[18,11,19,11],[18,12,19,12],[18,13,19,13],[18,14,19,14],[20,8,22,8],[20,9,22,9],[20,10,22,10],[20,11,22,11],[20,12,22,12],[20,13,22,13],[20,14,22,14],[23,4,42,4],[23,5,42,5],[23,6,26,6],[23,7,26,7],[23,8,26,8],[23,10,42,10],[23,14,26,14],[23,15,26,15],[23,16,26,16],[23,17,42,17],[24,9,25,9],[27,6,30,6],[27,7,30,7],[27,8,30,8],[27,14,30,14],[27,15,30,15],[27,16,30,16],[28,9,29,9],[31,6,34,6],[31,7,34,7],[31,8,34,8],[31,14,34,14],[31,15,34,15],[31,16,34,16],[32,9,33,9],[32,11,33,11],[32,13,33,13],[35,6,38,6],[35,7,38,7],[35,8,38,8],[35,14,38,14],[35,15,38,15],[35,16,38,16],[36,9,37,9],[39,6,42,6],[39,7,42,7],[39,8,42,8],[39,14,42,14],[39,15,42,15],[39,16,42,16],[40,9,41,9],[43,8,45,8],[43,9,45,9],[43,10,45,10],[43,11,45,11],[43,12,45,12],[43,13,45,13],[46,8,47,8],[46,9,47,9],[46,10,47,10],[46,11,47,11],[46,12,47,12],[46,13,47,13],[48,8,51,8],[48,9,51,9],[48,10,51,10],[48,11,51,11],[48,12,51,12],[48,13,51,13],[52,9,54,13],[55,9,57,13],[60,9,60,13],[71,9,71,13]]}
[]
[null,"Określenie przemieszczenia δN w miejscu występowania łącznika, przy działaniu wiatru II"]
[]
[null,"Wiatr II - różne warunki w zależności od kierunku"]
[]
[null,"UWAGA! Wymiary rzutu budynku i szerokości pól ściany nie są pokazywane w skali."]
[]
[{"$nulls":7},"Przemieszczenie wg ETA, δm, mm",{"$nulls":7},{"v":0.8,"d":"0.80"}]
[{"$nulls":7},"Siła wyrywająca wg ETA, N, kN",{"$nulls":7},{"v":0.4,"d":"0.40"}]
[{"$nulls":7},"Przemieszczenie graniczne δ (w miejscu występowania łącznika), mm",{"$nulls":7},0.333]
[]
[{"$nulls":9},{"$f":"\"Wysokość  ze = \"&TEXT('Obliczenia wiatr II'!E42,\"####0,0##\")&\" m\"","v":"Wysokość  ze = 25,0 m"}]
[]
[]
[{"$nulls":8},"m",{"$f":"'Wyniki graficzne wiatr II'!J11","v":5.6},{"$f":"'Wyniki graficzne wiatr II'!K11","v":""},{"$f":"'Wyniki graficzne wiatr II'!L11","v":4.4},{"$f":"'Wyniki graficzne wiatr II'!M11","v":""},{"$f":"'Wyniki graficzne wiatr II'!N11","v":""}]
[]
[]
[]
[{"$nulls":8},"δN          mm",{"$f":"$P$8*J63/'Łączniki wiatr II'!J21/$P$9","v":{"v":0.35654369492677795,"d":"0.357"}},{"$f":"$P$8*K63/'Łączniki wiatr II'!K21/$P$9","v":{"v":0.35654369492677795,"d":"0.357"}},{"$f":"$P$8*L63/'Łączniki wiatr II'!L21/$P$9","v":{"v":0.3735219661137674,"d":"0.374"}},{"$f":"$P$8*M63/'Łączniki wiatr II'!M21/$P$9","v":{"v":0.3735219661137674,"d":"0.374"}},{"$f":"$P$8*N63/'Łączniki wiatr II'!N21/$P$9","v":{"v":0.3735219661137674,"d":"0.374"}},"δN          mm"]
[]
[{"$nulls":8},"Łączniki min. szt./m²",{"$f":"$P$8*J63/($P$9*$P$10)","v":{"v":8.565614292535207,"d":"8.6"}},{"$f":"$P$8*K63/($P$9*$P$10)","v":{"v":8.565614292535207,"d":"8.6"}},{"v":6.730125515563377,"d":"6.7"},{"v":6.730125515563377,"d":"6.7"},{"v":6.730125515563377,"d":"6.7"},"Łączniki min. szt./m²"]
[]
[{"$nulls":6},"m","δN, mm",{"$nulls":7},"δN, mm","m"]
[{"$nulls":4},{"$f":"\"Wysokość  ze = \"&TEXT('Obliczenia wiatr II'!D42,\"####0,0##\")&\" m\"","v":"Wysokość  ze = 25,0 m"},{"$f":"TEXT(K75+K76+K77,\"####0,0##\")&\" m\"","v":"28,0 m"},{"$f":"'Wyniki graficzne wiatr II'!G20","v":{"v":2,"d":"2.0"}},{"$f":"$P$8*I64/'Łączniki wiatr II'!I24/$P$9","v":{"v":0.35654369492677795,"d":"0.357"}},{"$f":"$P$8*I64/($P$9*$P$10)","v":{"v":8.565614292535207,"d":"8.6"}},null,{"$f":"\"Przyjęta oś budynku, odchylona o kąt \"&TEXT('Obliczenia wiatr II'!C11,\"####0,0##\")&\"° od kierunku N\"","v":"Przyjęta oś budynku, odchylona o kąt 10,0° od kierunku N"},"Ściana I",null,null,{"$f":"$P$8*O64/($P$9*$P$10)","v":{"v":8.565614292535207,"d":"8.6"}},{"$f":"$P$8*O64/'Łączniki wiatr II'!O24/$P$9","v":{"v":0.35654369492677795,"d":"0.357"}},{"$f":"'Wyniki graficzne wiatr II'!Q20","v":{"v":2,"d":"2.0"}},{"$f":"\"Wysokość  ze = \"&TEXT('Obliczenia wiatr II'!D42,\"####0,0##\")&\" m\"","v":"Wysokość  ze = 25,0 m"}]
[]
[]
[]
[{"$nulls":6},{"$f":"'Wyniki graficzne wiatr II'!G24","v":{"v":8,"d":"8.0"}},{"$f":"$P$8*I65/'Łączniki wiatr II'!I28/$P$9","v":{"v":0.3735219661137674,"d":"0.374"}},{"$f":"$P$8*I65/($P$9*$P$10)","v":{"v":6.730125515563377,"d":"6.7"}},{"$nulls":5},{"$f":"$P$8*O65/($P$9*$P$10)","v":{"v":6.730125515563377,"d":"6.7"}},{"$f":"$P$8*O65/'Łączniki wiatr II'!O28/$P$9","v":{"v":0.3735219661137674,"d":"0.374"}},{"$f":"'Wyniki graficzne wiatr II'!Q24","v":{"v":8,"d":"8.0"}}]
[]
[]
[]
[{"$nulls":6},{"$f":"'Wyniki graficzne wiatr II'!G28","v":{"v":8,"d":"8.0"}},{"$f":"$P$8*I66/'Łączniki wiatr II'!I32/$P$9","v":{"v":0.20373925424387312,"d":"0.204"}},{"$f":"$P$8*I66/($P$9*$P$10)","v":{"v":3.0591479616197166,"d":"3.1"}},{"$nulls":5},{"$f":"$P$8*O66/($P$9*$P$10)","v":{"v":3.518020155862674,"d":"3.5"}},{"$f":"$P$8*O66/'Łączniki wiatr II'!O32/$P$9","v":{"v":0.23430014238045407,"d":"0.234"}},{"$f":"'Wyniki graficzne wiatr II'!Q28","v":{"v":16,"d":"16.0"}}]
[{"$nulls":9},"Ściana IV",null,"→",null,"Ściana II"]
[]
[]
[{"$nulls":6},{"$f":"'Wyniki graficzne wiatr II'!G32","v":{"v":8,"d":"8.0"}},{"$f":"$P$8*I67/'Łączniki wiatr II'!I36/$P$9","v":{"v":0.21963091607489527,"d":"0.220"}},{"$f":"$P$8*I67/($P$9*$P$10)","v":{"v":3.297761502626055,"d":"3.3"}},{"$nulls":5},{"$f":"$P$8*O67/($P$9*$P$10)","v":{"v":3.518020155862674,"d":"3.5"}},{"$f":"$P$8*O67/'Łączniki wiatr II'!O36/$P$9","v":{"v":0.23430014238045407,"d":"0.234"}},{"$f":"'Wyniki graficzne wiatr II'!Q32","v":""}]
[]
[]
[]
[{"$nulls":6},{"$f":"'Wyniki graficzne wiatr II'!G36","v":{"v":2,"d":"2.0"}},{"$f":"$P$8*I68/'Łączniki wiatr II'!I40/$P$9","v":{"v":0.2795302568225939,"d":"0.280"}},{"$f":"$P$8*I68/($P$9*$P$10)","v":{"v":4.197151003342251,"d":"4.2"}},{"$nulls":5},{"$f":"$P$8*O68/($P$9*$P$10)","v":{"v":4.197151003342251,"d":"4.2"}},{"$f":"$P$8*O68/'Łączniki wiatr II'!O40/$P$9","v":{"v":0.2795302568225939,"d":"0.280"}},{"$f":"'Wyniki graficzne wiatr II'!Q36","v":{"v":2,"d":"2.0"}}]
[]
[]
[{"$nulls":11},"Ściana III"]
[{"$nulls":8},"Łączniki min. szt./m²",{"$f":"$P$8*J69/($P$9*$P$10)","v":{"v":8.565614292535207,"d":"8.6"}},{"$f":"$P$8*K69/($P$9*$P$10)","v":{"v":8.565614292535207,"d":"8.6"}},{"v":6.730125515563377,"d":"6.7"},{"v":6.730125515563377,"d":"6.7"},{"v":6.730125515563377,"d":"6.7"}]
[]
[]
[{"$nulls":8},"δN          mm",{"$f":"$P$8*J69/'Łączniki wiatr II'!J44/$P$9","v":{"v":0.35654369492677795,"d":"0.357"}},{"$f":"$P$8*K69/'Łączniki wiatr II'!K44/$P$9","v":{"v":0.35654369492677795,"d":"0.357"}},{"$f":"$P$8*L69/'Łączniki wiatr II'!L44/$P$9","v":{"v":0.3735219661137674,"d":"0.374"}},{"$f":"$P$8*M69/'Łączniki wiatr II'!M44/$P$9","v":{"v":0.3735219661137674,"d":"0.374"}},{"$f":"$P$8*N69/'Łączniki wiatr II'!N44/$P$9","v":{"v":0.3735219661137674,"d":"0.374"}}]
[]
[{"$nulls":8},"m",{"$f":"'Wyniki graficzne wiatr II'!J45","v":5.6},{"$f":"'Wyniki graficzne wiatr II'!K45","v":""},{"$f":"'Wyniki graficzne wiatr II'!L45","v":4.4},{"$f":"'Wyniki graficzne wiatr II'!M45","v":""},{"$f":"'Wyniki graficzne wiatr II'!N45","v":""}]
[]
[]
[]
[{"$nulls":9},{"$f":"TEXT(N75+N76+N77,\"####0,0##\")&\" m\"","v":"10,0 m"}]
[]
[]
[{"$nulls":9},{"$f":"\"Wysokość  ze = \"&TEXT('Obliczenia wiatr II'!E42,\"####0,0##\")&\" m\"","v":"Wysokość  ze = 25,0 m"}]
[]
[]
[]
[]
[{"$nulls":9},"Charakterystyczne obciążenie wiatrem"]
[]
[{"$nulls":9},{"$f":"'Wyniki graficzne wiatr II'!J15/'Obliczenia wiatr II'!C90","v":{"v":1.4261747797071118,"d":"1.4262"}},{"$f":"'Wyniki graficzne wiatr II'!K15/'Obliczenia wiatr II'!C90","v":{"v":1.4261747797071118,"d":"1.4262"}},{"$f":"'Wyniki graficzne wiatr II'!L15/'Obliczenia wiatr II'!C90","v":{"v":1.1205658983413023,"d":"1.1206"}},{"$f":"'Wyniki graficzne wiatr II'!M15/'Obliczenia wiatr II'!C90","v":{"v":1.1205658983413023,"d":"1.1206"}},{"$f":"'Wyniki graficzne wiatr II'!N15/'Obliczenia wiatr II'!C90","v":{"v":1.1205658983413023,"d":"1.1206"}}]
[{"$nulls":8},{"$f":"'Wyniki graficzne wiatr II'!H20/'Obliczenia wiatr II'!C90","v":{"v":1.4261747797071118,"d":"1.4262"}},{"$nulls":5},{"$f":"'Wyniki graficzne wiatr II'!O20/'Obliczenia wiatr II'!C90","v":{"v":1.4261747797071118,"d":"1.4262"}}]
[{"$nulls":8},{"$f":"'Wyniki graficzne wiatr II'!H24/'Obliczenia wiatr II'!C90","v":{"v":1.1205658983413023,"d":"1.1206"}},{"$nulls":5},{"$f":"'Wyniki graficzne wiatr II'!O24/'Obliczenia wiatr II'!C90","v":{"v":1.1205658983413023,"d":"1.1206"}}]
[{"$nulls":8},{"$f":"'Wyniki graficzne wiatr II'!H28/'Obliczenia wiatr II'!C90","v":{"v":0.5093481356096828,"d":"0.5093"}},{"$nulls":5},{"$f":"'Wyniki graficzne wiatr II'!O28/'Obliczenia wiatr II'!C90","v":{"v":0.5857503559511352,"d":"0.5858"}}]
[{"$nulls":8},{"$f":"'Wyniki graficzne wiatr II'!H32/'Obliczenia wiatr II'!C90","v":{"v":0.5490772901872382,"d":"0.5491"}},{"$nulls":5},{"$f":"'Wyniki graficzne wiatr II'!O32/'Obliczenia wiatr II'!C90","v":{"v":0.5857503559511352,"d":"0.5858"}}]
[{"$nulls":8},{"$f":"'Wyniki graficzne wiatr II'!H36/'Obliczenia wiatr II'!C90","v":{"v":0.6988256420564848,"d":"0.6988"}},{"$nulls":5},{"$f":"'Wyniki graficzne wiatr II'!O36/'Obliczenia wiatr II'!C90","v":{"v":0.6988256420564848,"d":"0.6988"}}]
[{"$nulls":9},{"$f":"'Wyniki graficzne wiatr II'!J40/'Obliczenia wiatr II'!C90","v":{"v":1.4261747797071118,"d":"1.4262"}},{"$f":"'Wyniki graficzne wiatr II'!K40/'Obliczenia wiatr II'!C90","v":{"v":1.4261747797071118,"d":"1.4262"}},{"$f":"'Wyniki graficzne wiatr II'!L40/'Obliczenia wiatr II'!C90","v":{"v":1.1205658983413023,"d":"1.1206"}},{"$f":"'Wyniki graficzne wiatr II'!M40/'Obliczenia wiatr II'!C90","v":{"v":1.1205658983413023,"d":"1.1206"}},{"$f":"'Wyniki graficzne wiatr II'!N40/'Obliczenia wiatr II'!C90","v":{"v":1.1205658983413023,"d":"1.1206"}}]
[]
[]
[{"$nulls":9},"Tablica szerokości pól ściany"]
[]
[{"$nulls":10},"Ściana IV","Ściana I","Ściana II","Ściana III"]
[{"$nulls":9},"a",{"$f":"'Obliczenia wiatr II'!D35","v":2},{"$f":"'Obliczenia wiatr II'!E35","v":5.6},{"$f":"'Obliczenia wiatr II'!F35","v":2},{"$f":"'Obliczenia wiatr II'!G35","v":5.6}]
[{"$nulls":9},"b",{"$f":"'Obliczenia wiatr II'!D36","v":8},{"$f":"'Obliczenia wiatr II'!E36","v":4.4},{"$f":"'Obliczenia wiatr II'!F36","v":8},{"$f":"'Obliczenia wiatr II'!G36","v":4.4}]
[{"$nulls":9},"c",{"$f":"'Obliczenia wiatr II'!D37","v":{"v":18,"d":"18.0"}},{"$f":"'Obliczenia wiatr II'!E37","v":{"v":0,"d":"0.0"}},{"$f":"'Obliczenia wiatr II'!F37","v":{"v":18,"d":"18.0"}},{"$f":"'Obliczenia wiatr II'!G37","v":{"v":0,"d":"0.0"}}]
[]
[{"$nulls":9},"e (prost)",{"$f":"'Obliczenia wiatr II'!D29","v":{"v":10,"d":"10.0"}},{"$f":"'Obliczenia wiatr II'!E29","v":{"v":28,"d":"28.0"}},{"$f":"'Obliczenia wiatr II'!F29","v":{"v":10,"d":"10.0"}},{"$f":"'Obliczenia wiatr II'!G29","v":{"v":28,"d":"28.0"}}]

{"sheet":"Wyniki końcowe wiatr I","index":13,"n_rows":103,"n_cols":21,"rows_kept":103,"merged":[[1,1,2,21],[3,1,3,21],[5,1,5,21],[7,8,7,13],[8,8,8,13],[9,8,9,13],[11,9,13,13],[14,8,17,8],[14,9,17,9],[14,10,17,10],[14,11,17,11],[14,12,17,12],[14,13,17,13],[18,8,19,8],[18,9,19,9],[18,10,19,10],[18,11,19,11],[18,12,19,12],[18,13,19,13],[18,14,19,14],[20,8,22,8],[20,9,22,9],[20,10,22,10],[20,11,22,11],[20,12,22,12],[20,13,22,13],[20,14,22,14],[23,4,42,4],[23,5,42,5],[23,6,26,6],[23,7,26,7],[23,8,26,8],[23,14,26,14],[23,15,26,15],[23,16,26,16],[23,17,42,17],[24,9,25,9],[24,10,41,10],[27,6,30,6],[27,7,30,7],[27,8,30,8],[27,14,30,14],[27,15,30,15],[27,16,30,16],[28,9,29,9],[31,6,34,6],[31,7,34,7],[31,8,34,8],[31,14,34,14],[31,15,34,15],[31,16,34,16],[32,9,33,9],[32,11,33,11],[32,13,33,13],[35,6,38,6],[35,7,38,7],[35,8,38,8],[35,14,38,14],[35,15,38,15],[35,16,38,16],[36,9,37,9],[39,6,42,6],[39,7,42,7],[39,8,42,8],[39,14,42,14],[39,15,42,15],[39,16,42,16],[40,9,41,9],[43,8,45,8],[43,9,45,9],[43,10,45,10],[43,11,45,11],[43,12,45,12],[43,13,45,13],[46,8,47,8],[46,9,47,9],[46,10,47,10],[46,11,47,11],[46,12,47,12],[46,13,47,13],[48,8,51,8],[48,9,51,9],[48,10,51,10],[48,11,51,11],[48,12,51,12],[48,13,51,13],[52,9,54,13],[55,9,57,13],[60,9,60,13],[71,9,71,13],[80,1,80,6],[80,8,80,13],[80,15,80,20]]}
[]
[null,"Wymagana liczba łączników mechanicznych, przypadających na 1 m² powierzchni systemu ETICS, przy oddziaływaniu wiatru I "]
[]
[null,"Wiatr I -takie same warunki ze wszystkich kierunków"]
[]
[null,"UWAGA! Wymiary rzutu budynku i szerokości pól ściany nie są pokazywane w skali."]
[]
[{"$nulls":8},"Przyjęto układ łączników na:",{"$nulls":5},{"$f":"'Łączniki wiatr I'!O8","v":"T"}]
[{"$nulls":8},"Przyjęto minimalną liczbę łączników [szt./m²]:",{"$nulls":5},{"$f":"'Łączniki wiatr I'!O9","v":{"v":5,"d":"5.0"}}]
[{"$nulls":8},"Przyjęto przemieszczenie graniczne w miejscu łącznika [mm]:",{"$nulls":5},{"$f":"'Przemieszczenia wiatr I'!P10","v":0.333}]
[]
[{"$nulls":9},{"$f":"\"Wysokość  ze = \"&TEXT('Obliczenia wiatr I'!D46,\"####0,0##\")&\" m\"","v":"Wysokość  ze = 25,0 m"}]
[]
[]
[{"$nulls":8},"m",{"$f":"'Wyniki graficzne wiatr I'!J11","v":""},{"$f":"'Wyniki graficzne wiatr I'!K11","v":""},{"$f":"'Wyniki graficzne wiatr I'!L11","v":""},{"$f":"'Wyniki graficzne wiatr I'!M11","v":""},{"$f":"'Wyniki graficzne wiatr I'!N11","v":{"v":10,"d":"10.0"}}]
[]
[]
[]
[{"$nulls":8},"Schemat",{"$f":"IF(O8=\"T\",INDEX(F84:F100,MATCH(TRUE,G84:G100>=J21,0)),IF(O8=\"W\",INDEX(M84:M100,MATCH(TRUE,N84:N100>=J21,0)),IF(O8=\"H\",INDEX(T84:T103,MATCH(TRUE,U84:U103>=J21,0)),0)))","v":6},{"$f":"IF(O8=\"T\",INDEX(F84:F100,MATCH(TRUE,G84:G100>=K21,0)),IF(O8=\"W\",INDEX(M84:M100,MATCH(TRUE,N84:N100>=K21,0)),IF(O8=\"H\",INDEX(T84:T103,MATCH(TRUE,U84:U103>=K21,0)),0)))","v":6},{"$f":"IF(O8=\"T\",INDEX(F84:F100,MATCH(TRUE,G84:G100>=L21,0)),IF(O8=\"W\",INDEX(M84:M100,MATCH(TRUE,N84:N100>=L21,0)),IF(O8=\"H\",INDEX(T84:T103,MATCH(TRUE,U84:U103>=L21,0)),0)))","v":6},{"$f":"IF(O8=\"T\",INDEX(F84:F100,MATCH(TRUE,G84:G100>=M21,0)),IF(O8=\"W\",INDEX(M84:M100,MATCH(TRUE,N84:N100>=M21,0)),IF(O8=\"H\",INDEX(T84:T103,MATCH(TRUE,U84:U103>=M21,0)),0)))","v":6},{"$f":"IF(O8=\"T\",INDEX(F84:F100,MATCH(TRUE,G84:G100>=N21,0)),IF(O8=\"W\",INDEX(M84:M100,MATCH(TRUE,N84:N100>=N21,0)),IF(O8=\"H\",INDEX(T84:T103,MATCH(TRUE,U84:U103>=N21,0)),0)))","v":6},"Schemat"]
[]
[{"$nulls":8},"Łączniki min. szt./m²",{"$f":"MAX('Łączniki wiatr I'!J21,'Przemieszczenia wiatr I'!J21)","v":{"v":8.565614292535207,"d":"8.6"}},{"$f":"MAX('Łączniki wiatr I'!K21,'Przemieszczenia wiatr I'!K21)","v":{"v":8.565614292535207,"d":"8.6"}},{"$f":"MAX('Łączniki wiatr I'!L21,'Przemieszczenia wiatr I'!L21)","v":{"v":8.565614292535207,"d":"8.6"}},{"$f":"MAX('Łączniki wiatr I'!M21,'Przemieszczenia wiatr I'!M21)","v":{"v":8.565614292535207,"d":"8.6"}},{"$f":"MAX('Łączniki wiatr I'!N21,'Przemieszczenia wiatr I'!N21)","v":{"v":8.565614292535207,"d":"8.6"}},"Łączniki min. szt./m²"]
[]
[{"$nulls":6},"m","Schemat",{"$nulls":7},"Schemat","m"]
[{"$nulls":4},{"$f":"\"Wysokość  ze = \"&TEXT('Obliczenia wiatr I'!C46,\"####0,0##\")&\" m\"","v":"Wysokość  ze = 25,0 m"},{"$f":"TEXT(K75+K76+K77,\"####0,0##\")&\" m\"","v":"28,0 m"},{"$f":"'Wyniki graficzne wiatr I'!G20","v":{"v":2,"d":"2.0"}},{"$f":"IF(O8=\"T\",INDEX(F84:F100,MATCH(TRUE,G84:G100>=I24,0)),IF(O8=\"W\",INDEX(M84:M100,MATCH(TRUE,N84:N100>=I24,0)),IF(O8=\"H\",INDEX(T84:T103,MATCH(TRUE,U84:U103>=I24,0)),0)))","v":6},{"$f":"MAX('Łączniki wiatr I'!I24,'Przemieszczenia wiatr I'!I24)","v":{"v":8.565614292535207,"d":"8.6"}},null,null,"Ściana I",null,null,{"$f":"MAX('Łączniki wiatr I'!O24,'Przemieszczenia wiatr I'!O24)","v":{"v":8.565614292535207,"d":"8.6"}},{"$f":"IF(O8=\"T\",INDEX(F84:F100,MATCH(TRUE,G84:G100>=O24,0)),IF(O8=\"W\",INDEX(M84:M100,MATCH(TRUE,N84:N100>=O24,0)),IF(O8=\"H\",INDEX(T84:T103,MATCH(TRUE,U84:U103>=O24,0)),0)))","v":6},{"$f":"'Wyniki graficzne wiatr I'!Q20","v":{"v":2,"d":"2.0"}},{"$f":"\"Wysokość  ze = \"&TEXT('Obliczenia wiatr I'!C46,\"####0,0##\")&\" m\"","v":"Wysokość  ze = 25,0 m"}]
[]
[]
[]
[{"$nulls":6},{"$f":"'Wyniki graficzne wiatr I'!G24","v":{"v":8,"d":"8.0"}},{"$f":"IF(O8=\"T\",INDEX(F84:F100,MATCH(TRUE,G84:G100>=I28,0)),IF(O8=\"W\",INDEX(M84:M100,MATCH(TRUE,N84:N100>=I28,0)),IF(O8=\"H\",INDEX(T84:T103,MATCH(TRUE,U84:U103>=I28,0)),0)))","v":4},{"$f":"MAX('Łączniki wiatr I'!I28,'Przemieszczenia wiatr I'!I28)","v":{"v":6.730125515563377,"d":"6.7"}},{"$nulls":5},{"$f":"MAX('Łączniki wiatr I'!O28,'Przemieszczenia wiatr I'!O28)","v":{"v":6.730125515563377,"d":"6.7"}},{"$f":"IF(O8=\"T\",INDEX(F84:F100,MATCH(TRUE,G84:G100>=O28,0)),IF(O8=\"W\",INDEX(M84:M100,MATCH(TRUE,N84:N100>=O28,0)),IF(O8=\"H\",INDEX(T84:T103,MATCH(TRUE,U84:U103>=O28,0)),0)))","v":4},{"$f":"'Wyniki graficzne wiatr I'!Q24","v":{"v":8,"d":"8.0"}}]
[]
[]
[]
[{"$nulls":6},{"$f":"'Wyniki graficzne wiatr I'!G28","v":{"v":8,"d":"8.0"}},{"$f":"IF(O8=\"T\",INDEX(F84:F100,MATCH(TRUE,G84:G100>=I32,0)),IF(O8=\"W\",INDEX(M84:M100,MATCH(TRUE,N84:N100>=I32,0)),IF(O8=\"H\",INDEX(T84:T103,MATCH(TRUE,U84:U103>=I32,0)),0)))","v":2},{"$f":"MAX('Łączniki wiatr I'!I32,'Przemieszczenia wiatr I'!I32)","v":{"v":5,"d":"5.0"}},{"$nulls":5},{"$f":"MAX('Łączniki wiatr I'!O32,'Przemieszczenia wiatr I'!O32)","v":{"v":5,"d":"5.0"}},{"$f":"IF(O8=\"T\",INDEX(F84:F100,MATCH(TRUE,G84:G100>=O32,0)),IF(O8=\"W\",INDEX(M84:M100,MATCH(TRUE,N84:N100>=O32,0)),IF(O8=\"H\",INDEX(T84:T103,MATCH(TRUE,U84:U103>=O32,0)),0)))","v":2},{"$f":"'Wyniki graficzne wiatr I'!Q28","v":{"v":8,"d":"8.0"}}]
[{"$nulls":9},"Ściana IV",{"$nulls":3},"Ściana II"]
[]
[]
[{"$nulls":6},{"$f":"'Wyniki graficzne wiatr I'!G32","v":{"v":8,"d":"8.0"}},{"$f":"IF(O8=\"T\",INDEX(F84:F100,MATCH(TRUE,G84:G100>=I36,0)),IF(O8=\"W\",INDEX(M84:M100,MATCH(TRUE,N84:N100>=I36,0)),IF(O8=\"H\",INDEX(T84:T103,MATCH(TRUE,U84:U103>=I36,0)),0)))","v":4},{"$f":"MAX('Łączniki wiatr I'!I36,'Przemieszczenia wiatr I'!I36)","v":{"v":6.730125515563377,"d":"6.7"}},{"$nulls":5},{"$f":"MAX('Łączniki wiatr I'!O36,'Przemieszczenia wiatr I'!O36)","v":{"v":6.730125515563377,"d":"6.7"}},{"$f":"IF(O8=\"T\",INDEX(F84:F100,MATCH(TRUE,G84:G100>=O36,0)),IF(O8=\"W\",INDEX(M84:M100,MATCH(TRUE,N84:N100>=O36,0)),IF(O8=\"H\",INDEX(T84:T103,MATCH(TRUE,U84:U103>=O36,0)),0)))","v":4},{"$f":"'Wyniki graficzne wiatr I'!Q32","v":{"v":8,"d":"8.0"}}]
[]
[]
[]
[{"$nulls":6},{"$f":"'Wyniki graficzne wiatr I'!G36","v":{"v":2,"d":"2.0"}},{"$f":"IF(O8=\"T\",INDEX(F84:F100,MATCH(TRUE,G84:G100>=I40,0)),IF(O8=\"W\",INDEX(M84:M100,MATCH(TRUE,N84:N100>=I40,0)),IF(O8=\"H\",INDEX(T84:T103,MATCH(TRUE,U84:U103>=I40,0)),0)))","v":6},{"$f":"MAX('Łączniki wiatr I'!I40,'Przemieszczenia wiatr I'!I40)","v":{"v":8.565614292535207,"d":"8.6"}},{"$nulls":5},{"$f":"MAX('Łączniki wiatr I'!O40,'Przemieszczenia wiatr I'!O40)","v":{"v":8.565614292535207,"d":"8.6"}},{"$f":"IF(O8=\"T\",INDEX(F84:F100,MATCH(TRUE,G84:G100>=O40,0)),IF(O8=\"W\",INDEX(M84:M100,MATCH(TRUE,N84:N100>=O40,0)),IF(O8=\"H\",INDEX(T84:T103,MATCH(TRUE,U84:U103>=O40,0)),0)))","v":6},{"$f":"'Wyniki graficzne wiatr I'!Q36","v":{"v":2,"d":"2.0"}}]
[]
[]
[{"$nulls":11},"Ściana III"]
[{"$nulls":8},"Łączniki min. szt./m²",{"$f":"MAX('Łączniki wiatr I'!J44,'Przemieszczenia wiatr I'!J44)","v":{"v":8.565614292535207,"d":"8.6"}},{"$f":"MAX('Łączniki wiatr I'!K44,'Przemieszczenia wiatr I'!K44)","v":{"v":8.565614292535207,"d":"8.6"}},{"$f":"MAX('Łączniki wiatr I'!L44,'Przemieszczenia wiatr I'!L44)","v":{"v":8.565614292535207,"d":"8.6"}},{"$f":"MAX('Łączniki wiatr I'!M44,'Przemieszczenia wiatr I'!M44)","v":{"v":8.565614292535207,"d":"8.6"}},{"$f":"MAX('Łączniki wiatr I'!N44,'Przemieszczenia wiatr I'!N44)","v":{"v":8.565614292535207,"d":"8.6"}}]
[]
[]
[{"$nulls":8},"Schemat",{"$f":"IF(O8=\"T\",INDEX(F84:F100,MATCH(TRUE,G84:G100>=J44,0)),IF(O8=\"W\",INDEX(M84:M100,MATCH(TRUE,N84:N100>=J44,0)),IF(O8=\"H\",INDEX(T84:T103,MATCH(TRUE,U84:U103>=J44,0)),0)))","v":6},{"$f":"IF(O8=\"T\",INDEX(F84:F100,MATCH(TRUE,G84:G100>=K44,0)),IF(O8=\"W\",INDEX(M84:M100,MATCH(TRUE,N84:N100>=K44,0)),IF(O8=\"H\",INDEX(T84:T103,MATCH(TRUE,U84:U103>=K44,0)),0)))","v":6},{"$f":"IF(O8=\"T\",INDEX(F84:F100,MATCH(TRUE,G84:G100>=L44,0)),IF(O8=\"W\",INDEX(M84:M100,MATCH(TRUE,N84:N100>=L44,0)),IF(O8=\"H\",INDEX(T84:T103,MATCH(TRUE,U84:U103>=L44,0)),0)))","v":6},{"$f":"IF(O8=\"T\",INDEX(F84:F100,MATCH(TRUE,G84:G100>=M44,0)),IF(O8=\"W\",INDEX(M84:M100,MATCH(TRUE,N84:N100>=M44,0)),IF(O8=\"H\",INDEX(T84:T103,MATCH(TRUE,U84:U103>=M44,0)),0)))","v":6},{"$f":"IF(O8=\"T\",INDEX(F84:F100,MATCH(TRUE,G84:G100>=N44,0)),IF(O8=\"W\",INDEX(M84:M100,MATCH(TRUE,N84:N100>=N44,0)),IF(O8=\"H\",INDEX(T84:T103,MATCH(TRUE,U84:U103>=N44,0)),0)))","v":6}]
[]
[{"$nulls":8},"m",{"$f":"'Wyniki graficzne wiatr I'!J45","v":""},{"$f":"'Wyniki graficzne wiatr I'!K45","v":""},{"$f":"'Wyniki graficzne wiatr I'!L45","v":""},{"$f":"'Wyniki graficzne wiatr I'!M45","v":""},{"$f":"'Wyniki graficzne wiatr I'!N45","v":{"v":10,"d":"10.0"}}]
[]
[]
[]
[{"$nulls":9},{"$f":"TEXT(N75+N76+N77,\"####0,0##\")&\" m\"","v":"10,0 m"}]
[]
[]
[{"$nulls":9},{"$f":"\"Wysokość  ze = \"&TEXT('Obliczenia wiatr I'!D46,\"####0,0##\")&\" m\"","v":"Wysokość  ze = 25,0 m"}]
[]
[]
[]
[]
[{"$nulls":9},"Wymagana nośność"]
[]
[{"$nulls":9},{"$f":"(1-O10/100)*'Wyniki graficzne wiatr I'!J15","v":{"v":2.132138426536031,"d":"2.1321"}},{"$f":"(1-O10/100)*'Wyniki graficzne wiatr I'!K15","v":{"v":2.132138426536031,"d":"2.1321"}},{"$f":"(1-O10/100)*'Wyniki graficzne wiatr I'!L15","v":{"v":2.132138426536031,"d":"2.1321"}},{"$f":"(1-O10/100)*'Wyniki graficzne wiatr I'!M15","v":{"v":2.132138426536031,"d":"2.1321"}},{"$f":"(1-O10/100)*'Wyniki graficzne wiatr I'!N15","v":{"v":2.132138426536031,"d":"2.1321"}}]
[{"$nulls":8},{"$f":"(1-O10/100)*'Wyniki graficzne wiatr I'!H20","v":{"v":2.132138426536031,"d":"2.1321"}},{"$nulls":5},{"$f":"(1-O10/100)*'Wyniki graficzne wiatr I'!O20","v":{"v":2.132138426536031,"d":"2.1321"}}]
[{"$nulls":8},{"$f":"(1-O10/100)*'Wyniki graficzne wiatr I'!H24","v":{"v":1.6752516208497386,"d":"1.6753"}},{"$nulls":5},{"$f":"(1-O10/100)*'Wyniki graficzne wiatr I'!O24","v":{"v":1.6752516208497386,"d":"1.6753"}}]
[{"$nulls":8},{"$f":"(1-O10/100)*'Wyniki graficzne wiatr I'!H28","v":{"v":0.8756997108987269,"d":"0.8757"}},{"$nulls":5},{"$f":"(1-O10/100)*'Wyniki graficzne wiatr I'!O28","v":{"v":0.8756997108987269,"d":"0.8757"}}]
[{"$nulls":8},{"$f":"(1-O10/100)*'Wyniki graficzne wiatr I'!H32","v":{"v":1.6752516208497386,"d":"1.6753"}},{"$nulls":5},{"$f":"(1-O10/100)*'Wyniki graficzne wiatr I'!O32","v":{"v":1.6752516208497386,"d":"1.6753"}}]
[{"$nulls":8},{"$f":"(1-O10/100)*'Wyniki graficzne wiatr I'!H36","v":{"v":2.132138426536031,"d":"2.1321"}},{"$nulls":5},{"$f":"(1-O10/100)*'Wyniki graficzne wiatr I'!O36","v":{"v":2.132138426536031,"d":"2.1321"}}]
[{"$nulls":9},{"$f":"(1-O10/100)*'Wyniki graficzne wiatr I'!J40","v":{"v":2.132138426536031,"d":"2.1321"}},{"$f":"(1-O10/100)*'Wyniki graficzne wiatr I'!K40","v":{"v":2.132138426536031,"d":"2.1321"}},{"$f":"(1-O10/100)*'Wyniki graficzne wiatr I'!L40","v":{"v":2.132138426536031,"d":"2.1321"}},{"$f":"(1-O10/100)*'Wyniki graficzne wiatr I'!M40","v":{"v":2.132138426536031,"d":"2.1321"}},{"$f":"(1-O10/100)*'Wyniki graficzne wiatr I'!N40","v":{"v":2.132138426536031,"d":"2.1321"}}]
[]
[]
[{"$nulls":9},"Tablica szerokości pól ściany"]
[]
[{"$nulls":10},"Ściana IV","Ściana I","Ściana II","Ściana III"]
[{"$nulls":9},"a",{"$f":"'Obliczenia wiatr I'!C31","v":2},{"$f":"'Obliczenia wiatr I'!D31","v":5.6},{"$f":"'Obliczenia wiatr I'!C31","v":2},{"$f":"'Obliczenia wiatr I'!D31","v":5.6}]
[{"$nulls":9},"b",{"$f":"'Obliczenia wiatr I'!C32","v":8},{"$f":"'Obliczenia wiatr I'!D32","v":4.4},{"$f":"'Obliczenia wiatr I'!C32","v":8},{"$f":"'Obliczenia wiatr I'!D32","v":4.4}]
[{"$nulls":9},"c",{"$f":"'Obliczenia wiatr I'!C33","v":{"v":18,"d":"18.0"}},{"$f":"'Obliczenia wiatr I'!D33","v":{"v":0,"d":"0.0"}},{"$f":"'Obliczenia wiatr I'!C33","v":{"v":18,"d":"18.0"}},{"$f":"'Obliczenia wiatr I'!D33","v":{"v":0,"d":"0.0"}}]
[]
[{"$nulls":9},"e (prost)",{"$f":"'Obliczenia wiatr I'!C25","v":{"v":10,"d":"10.0"}},{"$f":"'Obliczenia wiatr I'!D25","v":{"v":28,"d":"28.0"}},{"$f":"'Obliczenia wiatr I'!C25","v":{"v":10,"d":"10.0"}},{"$f":"'Obliczenia wiatr I'!D25","v":{"v":28,"d":"28.0"}}]
[]
[null,"T",{"$nulls":6},"W",{"$nulls":6},"H"]
[]
[null,"Schemat","Łączniki","Nośność","Nośność","Schemat","Łączniki",null,"Schemat","Łączniki","Nośność","Nośność","Schemat","Łączniki",null,"Schemat","Łączniki","Nośność","Nośność","Schemat","Łączniki"]
[null,1,{"$f":"'Obliczenia nośności T'!$D$13","v":{"v":4,"d":"4.00"}},{"$f":"IF($C$84<$O$9,0,'Obliczenia nośności T'!$D$29)","v":{"v":0,"d":"0.00"}},{"$f":"SMALL(D84:D100,1)","v":{"v":0,"d":"0.00"}},{"$f":"INDEX(B84:B100,MATCH(E84,D84:D100,))","v":1},{"$f":"INDEX(C84:C100,MATCH(E84,D84:D100,))","v":{"v":4,"d":"4.0"}},null,1,{"$f":"'Obliczenia nośności W'!$D$13","v":{"v":3.3333333333333335,"d":"3.33"}},{"$f":"IF($J$84<$O$9,0,'Obliczenia nośności W'!$D$29)","v":{"v":0,"d":"0.00"}},{"$f":"SMALL(K84:K100,1)","v":{"v":0,"d":"0.00"}},{"$f":"INDEX(I84:I100,MATCH(L84,K84:K100,))","v":1},{"$f":"INDEX(J84:J100,MATCH(L84,K84:K100,))","v":{"v":3.3333333333333335,"d":"3.3"}},null,1,{"$f":"'Obliczenia nośności H'!$D$27","v":{"v":4.166666666666667,"d":"4.17"}},{"$f":"IF($Q$84<$O$9,0,'Obliczenia nośności H'!$D$43)","v":{"v":0,"d":"0.00"}},{"$f":"SMALL(R84:R103,1)","v":{"v":0,"d":"0.00"}},{"$f":"INDEX(P84:P103,MATCH(S84,R84:R103,))","v":1},{"$f":"INDEX(Q84:Q103,MATCH(S84,R84:R103,))","v":{"v":4.166666666666667,"d":"4.2"}}]
[null,2,{"$f":"'Obliczenia nośności T'!$E$13","v":{"v":5,"d":"5.00"}},{"$f":"IF($C$85<$O$9,0,'Obliczenia nośności T'!$E$29)","v":1.36},{"$f":"SMALL(D84:D100,2)","v":1.36},{"$f":"INDEX(B84:B100,MATCH(E85,D84:D100,))","v":2},{"$f":"INDEX(C84:C100,MATCH(E85,D84:D100,))","v":{"v":5,"d":"5.0"}},null,2,{"$f":"'Obliczenia nośności W'!$E$13","v":{"v":4.166666666666667,"d":"4.17"}},{"$f":"IF($J$85<$O$9,0,'Obliczenia nośności W'!$E$29)","v":{"v":0,"d":"0.00"}},{"$f":"SMALL(K84:K100,2)","v":{"v":0,"d":"0.00"}},{"$f":"INDEX(I84:I100,MATCH(L85,K84:K100,))","v":1},{"$f":"INDEX(J84:J100,MATCH(L85,K84:K100,))","v":{"v":3.3333333333333335,"d":"3.3"}},null,2,{"$f":"'Obliczenia nośności H'!$E$27","v":{"v":5.208333333333334,"d":"5.21"}},{"$f":"IF($Q$85<$O$9,0,'Obliczenia nośności H'!$E$43)","v":{"v":1.484375,"d":"1.48"}},{"$f":"SMALL(R84:R103,2)","v":{"v":0,"d":"0.00"}},{"$f":"INDEX(P84:P103,MATCH(S85,R84:R103,))","v":1},{"$f":"INDEX(Q84:Q103,MATCH(S85,R84:R103,))","v":{"v":4.166666666666667,"d":"4.2"}}]
[null,3,{"$f":"'Obliczenia nośności T'!$F$13","v":{"v":6,"d":"6.00"}},{"$f":"IF($C$86<$O$9,0,'Obliczenia nośności T'!$F$29)","v":{"v":1.6800000000000002,"d":"1.68"}},{"$f":"SMALL(D84:D100,3)","v":{"v":1.6800000000000002,"d":"1.68"}},{"$f":"INDEX(B84:B100,MATCH(E86,D84:D100,))","v":3},{"$f":"INDEX(C84:C100,MATCH(E86,D84:D100,))","v":{"v":6,"d":"6.0"}},null,3,{"$f":"'Obliczenia nośności W'!$F$13","v":{"v":5,"d":"5.00"}},{"$f":"IF($J$86<$O$9,0,'Obliczenia nośności W'!$F$29)","v":{"v":0.925,"d":"0.93"}},{"$f":"SMALL(K84:K100,3)","v":{"v":0,"d":"0.00"}},{"$f":"INDEX(I84:I100,MATCH(L86,K84:K100,))","v":1},{"$f":"INDEX(J84:J100,MATCH(L86,K84:K100,))","v":{"v":3.3333333333333335,"d":"3.3"}},null,3,{"$f":"'Obliczenia nośności H'!$F$27","v":6.25},{"$f":"IF($Q$86<$O$9,0,'Obliczenia nośności H'!$F$43)","v":{"v":1.78125,"d":"1.78"}},{"$f":"SMALL(R84:R103,3)","v":{"v":1.484375,"d":"1.48"}},{"$f":"INDEX(P84:P103,MATCH(S86,R84:R103,))","v":2},{"$f":"INDEX(Q84:Q103,MATCH(S86,R84:R103,))","v":{"v":5.208333333333334,"d":"5.2"}}]
[null,4,{"$f":"'Obliczenia nośności T'!$G$13","v":{"v":7,"d":"7.00"}},{"$f":"IF($C$87<$O$9,0,'Obliczenia nośności T'!$G$29)","v":{"v":2,"d":"2.00"}},{"$f":"SMALL(D84:D100,4)","v":{"v":2,"d":"2.00"}},{"$f":"INDEX(B84:B100,MATCH(E87,D84:D100,))","v":4},{"$f":"INDEX(C84:C100,MATCH(E87,D84:D100,))","v":{"v":7,"d":"7.0"}},null,4,{"$f":"'Obliczenia nośności W'!$G$13","v":{"v":5.833333333333334,"d":"5.83"}},{"$f":"IF($J$87<$O$9,0,'Obliczenia nośności W'!$G$29)","v":{"v":1.0791666666666668,"d":"1.08"}},{"$f":"SMALL(K84:K100,4)","v":{"v":0.925,"d":"0.93"}},{"$f":"INDEX(I84:I100,MATCH(L87,K84:K100,))","v":3},{"$f":"INDEX(J84:J100,MATCH(L87,K84:K100,))","v":{"v":5,"d":"5.0"}},null,4,{"$f":"'Obliczenia nośności H'!$G$27","v":{"v":7.291666666666667,"d":"7.29"}},{"$f":"IF($Q$87<$O$9,0,'Obliczenia nośności H'!$G$43)","v":{"v":2.078125,"d":"2.08"}},{"$f":"SMALL(R84:R103,4)","v":{"v":1.7812499999999998,"d":"1.78"}},{"$f":"INDEX(P84:P103,MATCH(S87,R84:R103,))","v":14},{"$f":"INDEX(Q84:Q103,MATCH(S87,R84:R103,))","v":{"v":6.25,"d":"6.3"}}]
[null,5,{"$f":"'Obliczenia nośności T'!$H$13","v":{"v":8,"d":"8.00"}},{"$f":"IF($C$88<$O$9,0,'Obliczenia nośności T'!$H$29)","v":{"v":2.3200000000000003,"d":"2.32"}},{"$f":"SMALL(D84:D100,5)","v":{"v":2.3200000000000003,"d":"2.32"}},{"$f":"INDEX(B84:B100,MATCH(E88,D84:D100,))","v":5},{"$f":"INDEX(C84:C100,MATCH(E88,D84:D100,))","v":{"v":8,"d":"8.0"}},null,5,{"$f":"'Obliczenia nośności W'!$H$13","v":{"v":6.666666666666667,"d":"6.67"}},{"$f":"IF($J$88<$O$9,0,'Obliczenia nośności W'!$H$29)","v":{"v":1.2333333333333334,"d":"1.23"}},{"$f":"SMALL(K84:K100,5)","v":{"v":1.0791666666666668,"d":"1.08"}},{"$f":"INDEX(I84:I100,MATCH(L88,K84:K100,))","v":4},{"$f":"INDEX(J84:J100,MATCH(L88,K84:K100,))","v":{"v":5.833333333333334,"d":"5.8"}},null,5,{"$f":"'Obliczenia nośności H'!$H$27","v":{"v":8.333333333333334,"d":"8.33"}},{"$f":"IF($Q$88<$O$9,0,'Obliczenia nośności H'!$H$43)","v":{"v":2.375,"d":"2.38"}},{"$f":"SMALL(R84:R103,5)","v":{"v":1.78125,"d":"1.78"}},{"$f":"INDEX(P84:P103,MATCH(S88,R84:R103,))","v":3},{"$f":"INDEX(Q84:Q103,MATCH(S88,R84:R103,))","v":{"v":6.25,"d":"6.3"}}]
[null,6,{"$f":"'Obliczenia nośności T'!$I$13","v":{"v":9,"d":"9.00"}},{"$f":"IF($C$89<$O$9,0,'Obliczenia nośności T'!$I$29)","v":2.64},{"$f":"SMALL(D84:D100,6)","v":2.64},{"$f":"INDEX(B84:B100,MATCH(E89,D84:D100,))","v":6},{"$f":"INDEX(C84:C100,MATCH(E89,D84:D100,))","v":{"v":9,"d":"9.0"}},null,6,{"$f":"'Obliczenia nośności W'!$I$13","v":{"v":7.5,"d":"7.50"}},{"$f":"IF($J$89<$O$9,0,'Obliczenia nośności W'!$I$29)","v":{"v":1.3875,"d":"1.39"}},{"$f":"SMALL(K84:K100,6)","v":{"v":1.2333333333333334,"d":"1.23"}},{"$f":"INDEX(I84:I100,MATCH(L89,K84:K100,))","v":5},{"$f":"INDEX(J84:J100,MATCH(L89,K84:K100,))","v":{"v":6.666666666666667,"d":"6.7"}},null,6,{"$f":"'Obliczenia nośności H'!$I$27","v":{"v":9.375,"d":"9.38"}},{"$f":"IF($Q$89<$O$9,0,'Obliczenia nośności H'!$I$43)","v":{"v":2.671875,"d":"2.67"}},{"$f":"SMALL(R84:R103,6)","v":{"v":2.078125,"d":"2.08"}},{"$f":"INDEX(P84:P103,MATCH(S89,R84:R103,))","v":4},{"$f":"INDEX(Q84:Q103,MATCH(S89,R84:R103,))","v":{"v":7.291666666666667,"d":"7.3"}}]
[null,7,{"$f":"'Obliczenia nośności T'!$J$13","v":{"v":10,"d":"10.00"}},{"$f":"IF($C$90<$O$9,0,'Obliczenia nośności T'!$J$29)","v":2.96},{"$f":"SMALL(D84:D100,7)","v":2.84},{"$f":"INDEX(B84:B100,MATCH(E90,D84:D100,))","v":17},{"$f":"INDEX(C84:C100,MATCH(E90,D84:D100,))","v":{"v":10,"d":"10.0"}},null,7,{"$f":"'Obliczenia nośności W'!$J$13","v":{"v":8.333333333333334,"d":"8.33"}},{"$f":"IF($J$90<$O$9,0,'Obliczenia nośności W'!$J$29)","v":{"v":1.5416666666666667,"d":"1.54"}},{"$f":"SMALL(K84:K100,7)","v":{"v":1.3875,"d":"1.39"}},{"$f":"INDEX(I84:I100,MATCH(L90,K84:K100,))","v":6},{"$f":"INDEX(J84:J100,MATCH(L90,K84:K100,))","v":7.5},null,7,{"$f":"'Obliczenia nośności H'!$J$27","v":{"v":10.416666666666668,"d":"10.42"}},{"$f":"IF($Q$90<$O$9,0,'Obliczenia nośności H'!$J$43)","v":{"v":2.96875,"d":"2.97"}},{"$f":"SMALL(R84:R103,7)","v":{"v":2.375,"d":"2.38"}},{"$f":"INDEX(P84:P103,MATCH(S90,R84:R103,))","v":5},{"$f":"INDEX(Q84:Q103,MATCH(S90,R84:R103,))","v":{"v":8.333333333333334,"d":"8.3"}}]
[null,8,{"$f":"'Obliczenia nośności T'!$K$13","v":{"v":11,"d":"11.00"}},{"$f":"IF($C$91<$O$9,0,'Obliczenia nośności T'!$K$29)","v":{"v":3.2800000000000002,"d":"3.28"}},{"$f":"SMALL(D84:D100,8)","v":2.96},{"$f":"INDEX(B84:B100,MATCH(E91,D84:D100,))","v":7},{"$f":"INDEX(C84:C100,MATCH(E91,D84:D100,))","v":{"v":10,"d":"10.0"}},null,8,{"$f":"'Obliczenia nośności W'!$K$13","v":{"v":9.166666666666668,"d":"9.17"}},{"$f":"IF($J$91<$O$9,0,'Obliczenia nośności W'!$K$29)","v":{"v":1.6958333333333335,"d":"1.70"}},{"$f":"SMALL(K84:K100,8)","v":{"v":1.5416666666666667,"d":"1.54"}},{"$f":"INDEX(I84:I100,MATCH(L91,K84:K100,))","v":7},{"$f":"INDEX(J84:J100,MATCH(L91,K84:K100,))","v":{"v":8.333333333333334,"d":"8.3"}},null,8,{"$f":"'Obliczenia nośności H'!$K$27","v":{"v":11.458333333333334,"d":"11.46"}},{"$f":"IF($Q$91<$O$9,0,'Obliczenia nośności H'!$K$43)","v":{"v":3.265625,"d":"3.27"}},{"$f":"SMALL(R84:R103,8)","v":{"v":2.375,"d":"2.38"}},{"$f":"INDEX(P84:P103,MATCH(S91,R84:R103,))","v":5},{"$f":"INDEX(Q84:Q103,MATCH(S91,R84:R103,))","v":{"v":8.333333333333334,"d":"8.3"}}]
[null,9,{"$f":"'Obliczenia nośności T'!$L$13","v":{"v":12,"d":"12.00"}},{"$f":"IF($C$92<$O$9,0,'Obliczenia nośności T'!$L$29)","v":{"v":3.6,"d":"3.60"}},{"$f":"SMALL(D84:D100,9)","v":{"v":3.2800000000000002,"d":"3.28"}},{"$f":"INDEX(B84:B100,MATCH(E92,D84:D100,))","v":8},{"$f":"INDEX(C84:C100,MATCH(E92,D84:D100,))","v":{"v":11,"d":"11.0"}},null,9,{"$f":"'Obliczenia nośności W'!$L$13","v":{"v":10,"d":"10.00"}},{"$f":"IF($J$92<$O$9,0,'Obliczenia nośności W'!$L$29)","v":1.85},{"$f":"SMALL(K84:K100,9)","v":{"v":1.6958333333333335,"d":"1.70"}},{"$f":"INDEX(I84:I100,MATCH(L92,K84:K100,))","v":8},{"$f":"INDEX(J84:J100,MATCH(L92,K84:K100,))","v":{"v":9.166666666666668,"d":"9.2"}},null,9,{"$f":"'Obliczenia nośności H'!$L$27","v":{"v":12.5,"d":"12.50"}},{"$f":"IF($Q$92<$O$9,0,'Obliczenia nośności H'!$L$43)","v":{"v":3.5625,"d":"3.56"}},{"$f":"SMALL(R84:R103,9)","v":{"v":2.671875,"d":"2.67"}},{"$f":"INDEX(P84:P103,MATCH(S92,R84:R103,))","v":6},{"$f":"INDEX(Q84:Q103,MATCH(S92,R84:R103,))","v":{"v":9.375,"d":"9.4"}}]
[null,10,{"$f":"'Obliczenia nośności T'!$M$13","v":{"v":12,"d":"12.00"}},{"$f":"IF($C$93<$O$9,0,'Obliczenia nośności T'!$M$29)","v":3.48},{"$f":"SMALL(D84:D100,10)","v":3.48},{"$f":"INDEX(B84:B100,MATCH(E93,D84:D100,))","v":10},{"$f":"INDEX(C84:C100,MATCH(E93,D84:D100,))","v":{"v":12,"d":"12.0"}},null,10,{"$f":"'Obliczenia nośności W'!$M$13","v":{"v":10.833333333333334,"d":"10.83"}},{"$f":"IF($J$93<$O$9,0,'Obliczenia nośności W'!$M$29)","v":{"v":2.0208333333333335,"d":"2.02"}},{"$f":"SMALL(K84:K100,10)","v":1.85},{"$f":"INDEX(I84:I100,MATCH(L93,K84:K100,))","v":9},{"$f":"INDEX(J84:J100,MATCH(L93,K84:K100,))","v":{"v":10,"d":"10.0"}},null,10,{"$f":"'Obliczenia nośności H'!$M$27","v":{"v":13.541666666666668,"d":"13.54"}},{"$f":"IF($Q$93<$O$9,0,'Obliczenia nośności H'!$M$43)","v":{"v":3.8593749999999996,"d":"3.86"}},{"$f":"SMALL(R84:R103,10)","v":{"v":2.96875,"d":"2.97"}},{"$f":"INDEX(P84:P103,MATCH(S93,R84:R103,))","v":7},{"$f":"INDEX(Q84:Q103,MATCH(S93,R84:R103,))","v":{"v":10.416666666666668,"d":"10.4"}}]
[null,11,{"$f":"'Obliczenia nośności T'!$N$13","v":{"v":13,"d":"13.00"}},{"$f":"IF($C$94<$O$9,0,'Obliczenia nośności T'!$N$29)","v":3.92},{"$f":"SMALL(D84:D100,11)","v":{"v":3.6,"d":"3.60"}},{"$f":"INDEX(B84:B100,MATCH(E94,D84:D100,))","v":9},{"$f":"INDEX(C84:C100,MATCH(E94,D84:D100,))","v":{"v":12,"d":"12.0"}},null,11,{"$f":"'Obliczenia nośności W'!$N$13","v":{"v":11.666666666666668,"d":"11.67"}},{"$f":"IF($J$94<$O$9,0,'Obliczenia nośności W'!$N$29)","v":{"v":2.191666666666667,"d":"2.19"}},{"$f":"SMALL(K84:K100,11)","v":{"v":2.0208333333333335,"d":"2.02"}},{"$f":"INDEX(I84:I100,MATCH(L94,K84:K100,))","v":10},{"$f":"INDEX(J84:J100,MATCH(L94,K84:K100,))","v":{"v":10.833333333333334,"d":"10.8"}},null,11,{"$f":"'Obliczenia nośności H'!$N$27","v":{"v":14.583333333333334,"d":"14.58"}},{"$f":"IF($Q$94<$O$9,0,'Obliczenia nośności H'!$N$43)","v":{"v":4.15625,"d":"4.16"}},{"$f":"SMALL(R84:R103,11)","v":{"v":2.96875,"d":"2.97"}},{"$f":"INDEX(P84:P103,MATCH(S94,R84:R103,))","v":7},{"$f":"INDEX(Q84:Q103,MATCH(S94,R84:R103,))","v":{"v":10.416666666666668,"d":"10.4"}}]
[null,12,{"$f":"'Obliczenia nośności T'!$O$13","v":{"v":13,"d":"13.00"}},{"$f":"IF($C$95<$O$9,0,'Obliczenia nośności T'!$O$29)","v":{"v":3.8000000000000003,"d":"3.80"}},{"$f":"SMALL(D84:D100,12)","v":{"v":3.8000000000000003,"d":"3.80"}},{"$f":"INDEX(B84:B100,MATCH(E95,D84:D100,))","v":12},{"$f":"INDEX(C84:C100,MATCH(E95,D84:D100,))","v":{"v":13,"d":"13.0"}},null,12,{"$f":"'Obliczenia nośności W'!$O$13","v":{"v":12.5,"d":"12.50"}},{"$f":"IF($J$95<$O$9,0,'Obliczenia nośności W'!$O$29)","v":{"v":2.3625,"d":"2.36"}},{"$f":"SMALL(K84:K100,12)","v":{"v":2.191666666666667,"d":"2.19"}},{"$f":"INDEX(I84:I100,MATCH(L95,K84:K100,))","v":11},{"$f":"INDEX(J84:J100,MATCH(L95,K84:K100,))","v":{"v":11.666666666666668,"d":"11.7"}},null,12,{"$f":"'Obliczenia nośności H'!$O$27","v":{"v":15.625,"d":"15.63"}},{"$f":"IF($Q$95<$O$9,0,'Obliczenia nośności H'!$O$43)","v":{"v":4.453125,"d":"4.45"}},{"$f":"SMALL(R84:R103,12)","v":{"v":3.265625,"d":"3.27"}},{"$f":"INDEX(P84:P103,MATCH(S95,R84:R103,))","v":8},{"$f":"INDEX(Q84:Q103,MATCH(S95,R84:R103,))","v":{"v":11.458333333333334,"d":"11.5"}}]
[null,13,{"$f":"'Obliczenia nośności T'!$P$13","v":{"v":14,"d":"14.00"}},{"$f":"IF($C$96<$O$9,0,'Obliczenia nośności T'!$P$29)","v":4.24},{"$f":"SMALL(D84:D100,13)","v":3.92},{"$f":"INDEX(B84:B100,MATCH(E96,D84:D100,))","v":11},{"$f":"INDEX(C84:C100,MATCH(E96,D84:D100,))","v":{"v":13,"d":"13.0"}},null,13,{"$f":"'Obliczenia nośności W'!$P$13","v":{"v":13.333333333333334,"d":"13.33"}},{"$f":"IF($J$96<$O$9,0,'Obliczenia nośności W'!$P$29)","v":{"v":2.533333333333333,"d":"2.53"}},{"$f":"SMALL(K84:K100,13)","v":{"v":2.3625,"d":"2.36"}},{"$f":"INDEX(I84:I100,MATCH(L96,K84:K100,))","v":12},{"$f":"INDEX(J84:J100,MATCH(L96,K84:K100,))","v":12.5},null,13,{"$f":"'Obliczenia nośności H'!$P$27","v":{"v":4.166666666666667,"d":"4.17"}},{"$f":"IF($Q$96<$O$9,0,'Obliczenia nośności H'!$P$43)","v":{"v":0,"d":"0.00"}},{"$f":"SMALL(R84:R103,13)","v":{"v":3.5624999999999996,"d":"3.56"}},{"$f":"INDEX(P84:P103,MATCH(S96,R84:R103,))","v":17},{"$f":"INDEX(Q84:Q103,MATCH(S96,R84:R103,))","v":12.5}]
[null,14,{"$f":"'Obliczenia nośności T'!$Q$13","v":{"v":14,"d":"14.00"}},{"$f":"IF($C$97<$O$9,0,'Obliczenia nośności T'!$Q$29)","v":4.12},{"$f":"SMALL(D84:D100,14)","v":4.12},{"$f":"INDEX(B84:B100,MATCH(E97,D84:D100,))","v":14},{"$f":"INDEX(C84:C100,MATCH(E97,D84:D100,))","v":{"v":14,"d":"14.0"}},null,14,{"$f":"'Obliczenia nośności W'!$Q$13","v":{"v":3.3333333333333335,"d":"3.33"}},{"$f":"IF($J$97<$O$9,0,'Obliczenia nośności W'!$Q$29)","v":{"v":0,"d":"0.00"}},{"$f":"SMALL(K84:K100,14)","v":{"v":2.533333333333333,"d":"2.53"}},{"$f":"INDEX(I84:I100,MATCH(L97,K84:K100,))","v":13},{"$f":"INDEX(J84:J100,MATCH(L97,K84:K100,))","v":{"v":13.333333333333334,"d":"13.3"}},null,14,{"$f":"'Obliczenia nośności H'!$Q$27","v":6.25},{"$f":"IF($Q$97<$O$9,0,'Obliczenia nośności H'!$Q$43)","v":{"v":1.7812499999999998,"d":"1.78"}},{"$f":"SMALL(R84:R103,14)","v":{"v":3.5625,"d":"3.56"}},{"$f":"INDEX(P84:P103,MATCH(S97,R84:R103,))","v":9},{"$f":"INDEX(Q84:Q103,MATCH(S97,R84:R103,))","v":12.5}]
[null,15,{"$f":"'Obliczenia nośności T'!$R$13","v":{"v":15,"d":"15.00"}},{"$f":"IF($C$98<$O$9,0,'Obliczenia nośności T'!$R$29)","v":{"v":4.4399999999999995,"d":"4.44"}},{"$f":"SMALL(D84:D100,15)","v":4.24},{"$f":"INDEX(B84:B100,MATCH(E98,D84:D100,))","v":13},{"$f":"INDEX(C84:C100,MATCH(E98,D84:D100,))","v":{"v":14,"d":"14.0"}},{"$nulls":8},15,{"$f":"'Obliczenia nośności H'!$R$27","v":{"v":8.333333333333334,"d":"8.33"}},{"$f":"IF($Q$98<$O$9,0,'Obliczenia nośności H'!$R$43)","v":{"v":2.375,"d":"2.38"}},{"$f":"SMALL(R84:R103,15)","v":{"v":3.8593749999999996,"d":"3.86"}},{"$f":"INDEX(P84:P103,MATCH(S98,R84:R103,))","v":10},{"$f":"INDEX(Q84:Q103,MATCH(S98,R84:R103,))","v":{"v":13.541666666666668,"d":"13.5"}}]
[null,16,{"$f":"'Obliczenia nośności T'!$S$13","v":{"v":16,"d":"16.00"}},{"$f":"IF($C$99<$O$9,0,'Obliczenia nośności T'!$S$29)","v":4.76},{"$f":"SMALL(D84:D100,16)","v":{"v":4.4399999999999995,"d":"4.44"}},{"$f":"INDEX(B84:B100,MATCH(E99,D84:D100,))","v":15},{"$f":"INDEX(C84:C100,MATCH(E99,D84:D100,))","v":{"v":15,"d":"15.0"}},{"$nulls":8},16,{"$f":"'Obliczenia nośności H'!$S$27","v":{"v":10.416666666666668,"d":"10.42"}},{"$f":"IF($Q$99<$O$9,0,'Obliczenia nośności H'!$S$43)","v":{"v":2.96875,"d":"2.97"}},{"$f":"SMALL(R84:R103,16)","v":{"v":4.15625,"d":"4.16"}},{"$f":"INDEX(P84:P103,MATCH(S99,R84:R103,))","v":11},{"$f":"INDEX(Q84:Q103,MATCH(S99,R84:R103,))","v":{"v":14.583333333333334,"d":"14.6"}}]
[null,17,{"$f":"'Obliczenia nośności T'!$T$13","v":{"v":10,"d":"10.00"}},{"$f":"IF($C$100<$O$9,0,'Obliczenia nośności T'!$T$29)","v":2.84},{"$f":"SMALL(D84:D100,17)","v":4.76},{"$f":"INDEX(B84:B100,MATCH(E100,D84:D100,))","v":16},{"$f":"INDEX(C84:C100,MATCH(E100,D84:D100,))","v":{"v":16,"d":"16.0"}},{"$nulls":8},17,{"$f":"'Obliczenia nośności H'!$T$27","v":{"v":12.5,"d":"12.50"}},{"$f":"IF($Q$100<$O$9,0,'Obliczenia nośności H'!$T$43)","v":{"v":3.5624999999999996,"d":"3.56"}},{"$f":"SMALL(R84:R103,17)","v":{"v":4.15625,"d":"4.16"}},{"$f":"INDEX(P84:P103,MATCH(S100,R84:R103,))","v":11},{"$f":"INDEX(Q84:Q103,MATCH(S100,R84:R103,))","v":{"v":14.583333333333334,"d":"14.6"}}]
[{"$nulls":15},18,{"$f":"'Obliczenia nośności H'!$U$27","v":{"v":14.583333333333334,"d":"14.58"}},{"$f":"IF($Q$101<$O$9,0,'Obliczenia nośności H'!$U$43)","v":{"v":4.15625,"d":"4.16"}},{"$f":"SMALL(R84:R103,18)","v":{"v":4.453125,"d":"4.45"}},{"$f":"INDEX(P84:P103,MATCH(S101,R84:R103,))","v":12},{"$f":"INDEX(Q84:Q103,MATCH(S101,R84:R103,))","v":{"v":15.625,"d":"15.6"}}]
[{"$nulls":15},19,{"$f":"'Obliczenia nośności H'!$V$27","v":{"v":16.666666666666668,"d":"16.67"}},{"$f":"IF($Q$102<$O$9,0,'Obliczenia nośności H'!$V$43)","v":4.75},{"$f":"SMALL(R84:R103,19)","v":4.75},{"$f":"INDEX(P84:P103,MATCH(S102,R84:R103,))","v":19},{"$f":"INDEX(Q84:Q103,MATCH(S102,R84:R103,))","v":{"v":16.666666666666668,"d":"16.7"}}]
[{"$nulls":15},20,{"$f":"'Obliczenia nośności H'!$W$27","v":{"v":20.833333333333336,"d":"20.83"}},{"$f":"IF($Q$103<$O$9,0,'Obliczenia nośności H'!$W$43)","v":{"v":5.9375,"d":"5.94"}},{"$f":"SMALL(R84:R103,20)","v":{"v":5.9375,"d":"5.94"}},{"$f":"INDEX(P84:P103,MATCH(S103,R84:R103,))","v":20},{"$f":"INDEX(Q84:Q103,MATCH(S103,R84:R103,))","v":{"v":20.833333333333336,"d":"20.8"}}]

{"sheet":"Wyniki końcowe wiatr II","index":14,"n_rows":103,"n_cols":21,"rows_kept":103,"merged":[[1,1,2,21],[3,1,3,21],[5,1,5,21],[7,8,7,13],[8,8,8,13],[9,8,9,13],[11,9,13,13],[14,8,17,8],[14,9,17,9],[14,10,17,10],[14,11,17,11],[14,12,17,12],[14,13,17,13],[18,8,19,8],[18,9,19,9],[18,10,19,10],[18,11,19,11],[18,12,19,12],[18,13,19,13],[18,14,19,14],[20,8,22,8],[20,9,22,9],[20,10,22,10],[20,11,22,11],[20,12,22,12],[20,13,22,13],[20,14,22,14],[23,4,42,4],[23,5,42,5],[23,6,26,6],[23,7,26,7],[23,8,26,8],[23,10,42,10],[23,14,26,14],[23,15,26,15],[23,16,26,16],[23,17,42,17],[24,9,25,9],[27,6,30,6],[27,7,30,7],[27,8,30,8],[27,14,30,14],[27,15,30,15],[27,16,30,16],[28,9,29,9],[31,6,34,6],[31,7,34,7],[31,8,34,8],[31,14,34,14],[31,15,34,15],[31,16,34,16],[32,9,33,9],[32,11,33,11],[32,13,33,13],[35,6,38,6],[35,7,38,7],[35,8,38,8],[35,14,38,14],[35,15,38,15],[35,16,38,16],[36,9,37,9],[39,6,42,6],[39,7,42,7],[39,8,42,8],[39,14,42,14],[39,15,42,15],[39,16,42,16],[40,9,41,9],[43,8,45,8],[43,9,45,9],[43,10,45,10],[43,11,45,11],[43,12,45,12],[43,13,45,13],[46,8,47,8],[46,9,47,9],[46,10,47,10],[46,11,47,11],[46,12,47,12],[46,13,47,13],[48,8,51,8],[48,9,51,9],[48,10,51,10],[48,11,51,11],[48,12,51,12],[48,13,51,13],[52,9,54,13],[55,9,57,13],[60,9,60,13],[71,9,71,13],[80,1,80,6],[80,8,80,13],[80,15,80,20]]}
[]
[null,"Wymagana liczba łączników mechanicznych, przypadających na 1 m² powierzchni systemu ETICS, przy oddziaływaniu wiatru II"]
[]
[null,"Wiatr II - różne warunki w zależności od kierunku"]
[]
[null,"UWAGA! Wymiary rzutu budynku i szerokości pól ściany nie są pokazywane w skali."]
[]
[{"$nulls":8},"Przyjęto układ łączników na:",{"$nulls":5},{"$f":"'Łączniki wiatr II'!O8","v":"T"}]
[{"$nulls":8},"Przyjęto minimalną liczbę łączników [szt./m²]:",{"$nulls":5},{"$f":"'Łączniki wiatr II'!O9","v":{"v":5,"d":"5.0"}}]
[{"$nulls":8},"Przyjęto przemieszczenie graniczne w miejscu łącznika [mm]:",{"$nulls":5},{"$f":"'Przemieszczenia wiatr II'!P10","v":0.333}]
[]
[{"$nulls":9},{"$f":"\"Wysokość  ze = \"&TEXT('Obliczenia wiatr II'!E42,\"####0,0##\")&\" m\"","v":"Wysokość  ze = 25,0 m"}]
[]
[]
[{"$nulls":8},"m",{"$f":"'Wyniki graficzne wiatr II'!J11","v":5.6},{"$f":"'Wyniki graficzne wiatr II'!K11","v":""},{"$f":"'Wyniki graficzne wiatr II'!L11","v":4.4},{"$f":"'Wyniki graficzne wiatr II'!M11","v":""},{"$f":"'Wyniki graficzne wiatr II'!N11","v":""}]
[]
[]
[]
[{"$nulls":8},"Schemat",{"$f":"IF(O8=\"T\",INDEX(F84:F100,MATCH(TRUE,G84:G100>=J21,0)),IF(O8=\"W\",INDEX(M84:M100,MATCH(TRUE,N84:N100>=J21,0)),IF(O8=\"H\",INDEX(T84:T103,MATCH(TRUE,U84:U103>=J21,0)),0)))","v":6},{"$f":"IF(O8=\"T\",INDEX(F84:F100,MATCH(TRUE,G84:G100>=K21,0)),IF(O8=\"W\",INDEX(M84:M100,MATCH(TRUE,N84:N100>=K21,0)),IF(O8=\"H\",INDEX(T84:T103,MATCH(TRUE,U84:U103>=K21,0)),0)))","v":6},{"$f":"IF(O8=\"T\",INDEX(F84:F100,MATCH(TRUE,G84:G100>=L21,0)),IF(O8=\"W\",INDEX(M84:M100,MATCH(TRUE,N84:N100>=L21,0)),IF(O8=\"H\",INDEX(T84:T103,MATCH(TRUE,U84:U103>=L21,0)),0)))","v":4},{"$f":"IF(O8=\"T\",INDEX(F84:F100,MATCH(TRUE,G84:G100>=M21,0)),IF(O8=\"W\",INDEX(M84:M100,MATCH(TRUE,N84:N100>=M21,0)),IF(O8=\"H\",INDEX(T84:T103,MATCH(TRUE,U84:U103>=M21,0)),0)))","v":4},{"$f":"IF(O8=\"T\",INDEX(F84:F100,MATCH(TRUE,G84:G100>=N21,0)),IF(O8=\"W\",INDEX(M84:M100,MATCH(TRUE,N84:N100>=N21,0)),IF(O8=\"H\",INDEX(T84:T103,MATCH(TRUE,U84:U103>=N21,0)),0)))","v":4},"Schemat"]
[]
[{"$nulls":8},"Łączniki min. szt./m²",{"$f":"MAX('Łączniki wiatr II'!J21,'Przemieszczenia wiatr II'!J21)","v":{"v":8.565614292535207,"d":"8.6"}},{"$f":"MAX('Łączniki wiatr II'!K21,'Przemieszczenia wiatr II'!K21)","v":{"v":8.565614292535207,"d":"8.6"}},{"$f":"MAX('Łączniki wiatr II'!L21,'Przemieszczenia wiatr II'!L21)","v":{"v":6.730125515563377,"d":"6.7"}},{"$f":"MAX('Łączniki wiatr II'!M21,'Przemieszczenia wiatr II'!M21)","v":{"v":6.730125515563377,"d":"6.7"}},{"$f":"MAX('Łączniki wiatr II'!N21,'Przemieszczenia wiatr II'!N21)","v":{"v":6.730125515563377,"d":"6.7"}},"Łączniki min. szt./m²"]
[]
[{"$nulls":6},"m","Schemat",{"$nulls":7},"Schemat","m"]
[{"$nulls":4},{"$f":"\"Wysokość  ze = \"&TEXT('Obliczenia wiatr II'!D42,\"####0,0##\")&\" m\"","v":"Wysokość  ze = 25,0 m"},{"$f":"TEXT(K75+K76+K77,\"####0,0##\")&\" m\"","v":"28,0 m"},{"$f":"'Wyniki graficzne wiatr II'!G20","v":{"v":2,"d":"2.0"}},{"$f":"IF(O8=\"T\",INDEX(F84:F100,MATCH(TRUE,G84:G100>=I24,0)),IF(O8=\"W\",INDEX(M84:M100,MATCH(TRUE,N84:N100>=I24,0)),IF(O8=\"H\",INDEX(T84:T103,MATCH(TRUE,U84:U103>=I24,0)),0)))","v":6},{"$f":"MAX('Łączniki wiatr II'!I24,'Przemieszczenia wiatr II'!I24)","v":{"v":8.565614292535207,"d":"8.6"}},null,{"$f":"\"Przyjęta oś budynku, odchylona o kąt \"&TEXT('Obliczenia wiatr II'!C11,\"####0,0##\")&\"° od kierunku N\"","v":"Przyjęta oś budynku, odchylona o kąt 10,0° od kierunku N"},"Ściana I",null,null,{"$f":"MAX('Łączniki wiatr II'!O24,'Przemieszczenia wiatr II'!O24)","v":{"v":8.565614292535207,"d":"8.6"}},{"$f":"IF(O8=\"T\",INDEX(F84:F100,MATCH(TRUE,G84:G100>=O24,0)),IF(O8=\"W\",INDEX(M84:M100,MATCH(TRUE,N84:N100>=O24,0)),IF(O8=\"H\",INDEX(T84:T103,MATCH(TRUE,U84:U103>=O24,0)),0)))","v":6},{"$f":"'Wyniki graficzne wiatr II'!Q20","v":{"v":2,"d":"2.0"}},{"$f":"\"Wysokość  ze = \"&TEXT('Obliczenia wiatr II'!D42,\"####0,0##\")&\" m\"","v":"Wysokość  ze = 25,0 m"}]
[]
[]
[]
[{"$nulls":6},{"$f":"'Wyniki graficzne wiatr II'!G24","v":{"v":8,"d":"8.0"}},{"$f":"IF(O8=\"T\",INDEX(F84:F100,MATCH(TRUE,G84:G100>=I28,0)),IF(O8=\"W\",INDEX(M84:M100,MATCH(TRUE,N84:N100>=I28,0)),IF(O8=\"H\",INDEX(T84:T103,MATCH(TRUE,U84:U103>=I28,0)),0)))","v":4},{"$f":"MAX('Łączniki wiatr II'!I28,'Przemieszczenia wiatr II'!I28)","v":{"v":6.730125515563377,"d":"6.7"}},{"$nulls":5},{"$f":"MAX('Łączniki wiatr II'!O28,'Przemieszczenia wiatr II'!O28)","v":{"v":6.730125515563377,"d":"6.7"}},{"$f":"IF(O8=\"T\",INDEX(F84:F100,MATCH(TRUE,G84:G100>=O28,0)),IF(O8=\"W\",INDEX(M84:M100,MATCH(TRUE,N84:N100>=O28,0)),IF(O8=\"H\",INDEX(T84:T103,MATCH(TRUE,U84:U103>=O28,0)),0)))","v":4},{"$f":"'Wyniki graficzne wiatr II'!Q24","v":{"v":8,"d":"8.0"}}]
[]
[]
[]
[{"$nulls":6},{"$f":"'Wyniki graficzne wiatr II'!G28","v":{"v":8,"d":"8.0"}},{"$f":"IF(O8=\"T\",INDEX(F84:F100,MATCH(TRUE,G84:G100>=I32,0)),IF(O8=\"W\",INDEX(M84:M100,MATCH(TRUE,N84:N100>=I32,0)),IF(O8=\"H\",INDEX(T84:T103,MATCH(TRUE,U84:U103>=I32,0)),0)))","v":2},{"$f":"MAX('Łączniki wiatr II'!I32,'Przemieszczenia wiatr II'!I32)","v":{"v":5,"d":"5.0"}},{"$nulls":5},{"$f":"MAX('Łączniki wiatr II'!O32,'Przemieszczenia wiatr II'!O32)","v":{"v":5,"d":"5.0"}},{"$f":"IF(O8=\"T\",INDEX(F84:F100,MATCH(TRUE,G84:G100>=O32,0)),IF(O8=\"W\",INDEX(M84:M100,MATCH(TRUE,N84:N100>=O32,0)),IF(O8=\"H\",INDEX(T84:T103,MATCH(TRUE,U84:U103>=O32,0)),0)))","v":2},{"$f":"'Wyniki graficzne wiatr II'!Q28","v":{"v":16,"d":"16.0"}}]
[{"$nulls":9},"Ściana IV",null,"→",null,"Ściana II"]
[]
[]
[{"$nulls":6},{"$f":"'Wyniki graficzne wiatr II'!G32","v":{"v":8,"d":"8.0"}},{"$f":"IF(O8=\"T\",INDEX(F84:F100,MATCH(TRUE,G84:G100>=I36,0)),IF(O8=\"W\",INDEX(M84:M100,MATCH(TRUE,N84:N100>=I36,0)),IF(O8=\"H\",INDEX(T84:T103,MATCH(TRUE,U84:U103>=I36,0)),0)))","v":2},{"$f":"MAX('Łączniki wiatr II'!I36,'Przemieszczenia wiatr II'!I36)","v":{"v":5,"d":"5.0"}},{"$nulls":5},{"$f":"MAX('Łączniki wiatr II'!O36,'Przemieszczenia wiatr II'!O36)","v":{"v":5,"d":"5.0"}},{"$f":"IF(O8=\"T\",INDEX(F84:F100,MATCH(TRUE,G84:G100>=O36,0)),IF(O8=\"W\",INDEX(M84:M100,MATCH(TRUE,N84:N100>=O36,0)),IF(O8=\"H\",INDEX(T84:T103,MATCH(TRUE,U84:U103>=O36,0)),0)))","v":2},{"$f":"'Wyniki graficzne wiatr II'!Q32","v":""}]
[]
[]
[]
[{"$nulls":6},{"$f":"'Wyniki graficzne wiatr II'!G36","v":{"v":2,"d":"2.0"}},{"$f":"IF(O8=\"T\",INDEX(F84:F100,MATCH(TRUE,G84:G100>=I40,0)),IF(O8=\"W\",INDEX(M84:M100,MATCH(TRUE,N84:N100>=I40,0)),IF(O8=\"H\",INDEX(T84:T103,MATCH(TRUE,U84:U103>=I40,0)),0)))","v":2},{"$f":"MAX('Łączniki wiatr II'!I40,'Przemieszczenia wiatr II'!I40)","v":{"v":5,"d":"5.0"}},{"$nulls":5},{"$f":"MAX('Łączniki wiatr II'!O40,'Przemieszczenia wiatr II'!O40)","v":{"v":5,"d":"5.0"}},{"$f":"IF(O8=\"T\",INDEX(F84:F100,MATCH(TRUE,G84:G100>=O40,0)),IF(O8=\"W\",INDEX(M84:M100,MATCH(TRUE,N84:N100>=O40,0)),IF(O8=\"H\",INDEX(T84:T103,MATCH(TRUE,U84:U103>=O40,0)),0)))","v":2},{"$f":"'Wyniki graficzne wiatr II'!Q36","v":{"v":2,"d":"2.0"}}]
[]
[]
[{"$nulls":11},"Ściana III"]
[{"$nulls":8},"Łączniki min. szt./m²",{"$f":"MAX('Łączniki wiatr II'!J44,'Przemieszczenia wiatr II'!J44)","v":{"v":8.565614292535207,"d":"8.6"}},{"$f":"MAX('Łączniki wiatr II'!K44,'Przemieszczenia wiatr II'!K44)","v":{"v":8.565614292535207,"d":"8.6"}},{"$f":"MAX('Łączniki wiatr II'!L44,'Przemieszczenia wiatr II'!L44)","v":{"v":6.730125515563377,"d":"6.7"}},{"$f":"MAX('Łączniki wiatr II'!M44,'Przemieszczenia wiatr II'!M44)","v":{"v":6.730125515563377,"d":"6.7"}},{"$f":"MAX('Łączniki wiatr II'!N44,'Przemieszczenia wiatr II'!N44)","v":{"v":6.730125515563377,"d":"6.7"}}]
[]
[]
[{"$nulls":8},"Schemat",{"$f":"IF(O8=\"T\",INDEX(F84:F100,MATCH(TRUE,G84:G100>=J44,0)),IF(O8=\"W\",INDEX(M84:M100,MATCH(TRUE,N84:N100>=J44,0)),IF(O8=\"H\",INDEX(T84:T103,MATCH(TRUE,U84:U103>=J44,0)),0)))","v":6},{"$f":"IF(O8=\"T\",INDEX(F84:F100,MATCH(TRUE,G84:G100>=K44,0)),IF(O8=\"W\",INDEX(M84:M100,MATCH(TRUE,N84:N100>=K44,0)),IF(O8=\"H\",INDEX(T84:T103,MATCH(TRUE,U84:U103>=K44,0)),0)))","v":6},{"$f":"IF(O8=\"T\",INDEX(F84:F100,MATCH(TRUE,G84:G100>=L44,0)),IF(O8=\"W\",INDEX(M84:M100,MATCH(TRUE,N84:N100>=L44,0)),IF(O8=\"H\",INDEX(T84:T103,MATCH(TRUE,U84:U103>=L44,0)),0)))","v":4},{"$f":"IF(O8=\"T\",INDEX(F84:F100,MATCH(TRUE,G84:G100>=M44,0)),IF(O8=\"W\",INDEX(M84:M100,MATCH(TRUE,N84:N100>=M44,0)),IF(O8=\"H\",INDEX(T84:T103,MATCH(TRUE,U84:U103>=M44,0)),0)))","v":4},{"$f":"IF(O8=\"T\",INDEX(F84:F100,MATCH(TRUE,G84:G100>=N44,0)),IF(O8=\"W\",INDEX(M84:M100,MATCH(TRUE,N84:N100>=N44,0)),IF(O8=\"H\",INDEX(T84:T103,MATCH(TRUE,U84:U103>=N44,0)),0)))","v":4}]
[]
[{"$nulls":8},"m",{"$f":"'Wyniki graficzne wiatr II'!J45","v":5.6},{"$f":"'Wyniki graficzne wiatr II'!K45","v":""},{"$f":"'Wyniki graficzne wiatr II'!L45","v":4.4},{"$f":"'Wyniki graficzne wiatr II'!M45","v":""},{"$f":"'Wyniki graficzne wiatr II'!N45","v":""}]
[]
[]
[]
[{"$nulls":9},{"$f":"TEXT(N75+N76+N77,\"####0,0##\")&\" m\"","v":"10,0 m"}]
[]
[]
[{"$nulls":9},{"$f":"\"Wysokość  ze = \"&TEXT('Obliczenia wiatr II'!E42,\"####0,0##\")&\" m\"","v":"Wysokość  ze = 25,0 m"}]
[]
[]
[]
[]
[{"$nulls":9},"Wymagana nośność"]
[]
[{"$nulls":9},{"$f":"(1-O10/100)*'Wyniki graficzne wiatr II'!J15","v":{"v":2.132138426536031,"d":"2.1321"}},{"$f":"(1-O10/100)*'Wyniki graficzne wiatr II'!K15","v":{"v":2.132138426536031,"d":"2.1321"}},{"$f":"(1-O10/100)*'Wyniki graficzne wiatr II'!L15","v":{"v":1.6752516208497386,"d":"1.6753"}},{"$f":"(1-O10/100)*'Wyniki graficzne wiatr II'!M15","v":{"v":1.6752516208497386,"d":"1.6753"}},{"$f":"(1-O10/100)*'Wyniki graficzne wiatr II'!N15","v":{"v":1.6752516208497386,"d":"1.6753"}}]
[{"$nulls":8},{"$f":"(1-O10/100)*'Wyniki graficzne wiatr II'!H20","v":{"v":2.132138426536031,"d":"2.1321"}},{"$nulls":5},{"$f":"(1-O10/100)*'Wyniki graficzne wiatr II'!O20","v":{"v":2.132138426536031,"d":"2.1321"}}]
[{"$nulls":8},{"$f":"(1-O10/100)*'Wyniki graficzne wiatr II'!H24","v":{"v":1.6752516208497386,"d":"1.6753"}},{"$nulls":5},{"$f":"(1-O10/100)*'Wyniki graficzne wiatr II'!O24","v":{"v":1.6752516208497386,"d":"1.6753"}}]
[{"$nulls":8},{"$f":"(1-O10/100)*'Wyniki graficzne wiatr II'!H28","v":{"v":0.7614780094771539,"d":"0.7615"}},{"$nulls":5},{"$f":"(1-O10/100)*'Wyniki graficzne wiatr II'!O28","v":{"v":0.8756997108987269,"d":"0.8757"}}]
[{"$nulls":8},{"$f":"(1-O10/100)*'Wyniki graficzne wiatr II'!H32","v":{"v":0.8208732942163719,"d":"0.8209"}},{"$nulls":5},{"$f":"(1-O10/100)*'Wyniki graficzne wiatr II'!O32","v":{"v":0.8756997108987269,"d":"0.8757"}}]
[{"$nulls":8},{"$f":"(1-O10/100)*'Wyniki graficzne wiatr II'!H36","v":{"v":1.044747829002655,"d":"1.0447"}},{"$nulls":5},{"$f":"(1-O10/100)*'Wyniki graficzne wiatr II'!O36","v":{"v":1.044747829002655,"d":"1.0447"}}]
[{"$nulls":9},{"$f":"(1-O10/100)*'Wyniki graficzne wiatr II'!J40","v":{"v":2.132138426536031,"d":"2.1321"}},{"$f":"(1-O10/100)*'Wyniki graficzne wiatr II'!K40","v":{"v":2.132138426536031,"d":"2.1321"}},{"$f":"(1-O10/100)*'Wyniki graficzne wiatr II'!L40","v":{"v":1.6752516208497386,"d":"1.6753"}},{"$f":"(1-O10/100)*'Wyniki graficzne wiatr II'!M40","v":{"v":1.6752516208497386,"d":"1.6753"}},{"$f":"(1-O10/100)*'Wyniki graficzne wiatr II'!N40","v":{"v":1.6752516208497386,"d":"1.6753"}}]
[]
[]
[{"$nulls":9},"Tablica szerokości pól ściany"]
[]
[{"$nulls":10},"Ściana IV","Ściana I","Ściana II","Ściana III"]
[{"$nulls":9},"a",{"$f":"'Obliczenia wiatr II'!D35","v":2},{"$f":"'Obliczenia wiatr II'!E35","v":5.6},{"$f":"'Obliczenia wiatr II'!F35","v":2},{"$f":"'Obliczenia wiatr II'!G35","v":5.6}]
[{"$nulls":9},"b",{"$f":"'Obliczenia wiatr II'!D36","v":8},{"$f":"'Obliczenia wiatr II'!E36","v":4.4},{"$f":"'Obliczenia wiatr II'!F36","v":8},{"$f":"'Obliczenia wiatr II'!G36","v":4.4}]
[{"$nulls":9},"c",{"$f":"'Obliczenia wiatr II'!D37","v":{"v":18,"d":"18.0"}},{"$f":"'Obliczenia wiatr II'!E37","v":{"v":0,"d":"0.0"}},{"$f":"'Obliczenia wiatr II'!F37","v":{"v":18,"d":"18.0"}},{"$f":"'Obliczenia wiatr II'!G37","v":{"v":0,"d":"0.0"}}]
[]
[{"$nulls":9},"e (prost)",{"$f":"'Obliczenia wiatr II'!D29","v":{"v":10,"d":"10.0"}},{"$f":"'Obliczenia wiatr II'!E29","v":{"v":28,"d":"28.0"}},{"$f":"'Obliczenia wiatr II'!F29","v":{"v":10,"d":"10.0"}},{"$f":"'Obliczenia wiatr II'!G29","v":{"v":28,"d":"28.0"}}]
[]
[null,"T",{"$nulls":6},"W",{"$nulls":6},"H"]
[]
[null,"Schemat","Łączniki","Nośność","Nośność","Schemat","Łączniki",null,"Schemat","Łączniki","Nośność","Nośność","Schemat","Łączniki",null,"Schemat","Łączniki","Nośność","Nośność","Schemat","Łączniki"]
[null,1,{"$f":"'Obliczenia nośności T'!$D$13","v":{"v":4,"d":"4.00"}},{"$f":"IF($C$84<$O$9,0,'Obliczenia nośności T'!$D$29)","v":{"v":0,"d":"0.00"}},{"$f":"SMALL(D84:D100,1)","v":{"v":0,"d":"0.00"}},{"$f":"INDEX(B84:B100,MATCH(E84,D84:D100,))","v":1},{"$f":"INDEX(C84:C100,MATCH(E84,D84:D100,))","v":{"v":4,"d":"4.0"}},null,1,{"$f":"'Obliczenia nośności W'!$D$13","v":{"v":3.3333333333333335,"d":"3.33"}},{"$f":"IF($J$84<$O$9,0,'Obliczenia nośności W'!$D$29)","v":{"v":0,"d":"0.00"}},{"$f":"SMALL(K84:K100,1)","v":{"v":0,"d":"0.00"}},{"$f":"INDEX(I84:I100,MATCH(L84,K84:K100,))","v":1},{"$f":"INDEX(J84:J100,MATCH(L84,K84:K100,))","v":{"v":3.3333333333333335,"d":"3.3"}},null,1,{"$f":"'Obliczenia nośności H'!$D$27","v":{"v":4.166666666666667,"d":"4.17"}},{"$f":"IF($Q$84<$O$9,0,'Obliczenia nośności H'!$D$43)","v":{"v":0,"d":"0.00"}},{"$f":"SMALL(R84:R103,1)","v":{"v":0,"d":"0.00"}},{"$f":"INDEX(P84:P103,MATCH(S84,R84:R103,))","v":1},{"$f":"INDEX(Q84:Q103,MATCH(S84,R84:R103,))","v":{"v":4.166666666666667,"d":"4.2"}}]
[null,2,{"$f":"'Obliczenia nośności T'!$E$13","v":{"v":5,"d":"5.00"}},{"$f":"IF($C$85<$O$9,0,'Obliczenia nośności T'!$E$29)","v":1.36},{"$f":"SMALL(D84:D100,2)","v":1.36},{"$f":"INDEX(B84:B100,MATCH(E85,D84:D100,))","v":2},{"$f":"INDEX(C84:C100,MATCH(E85,D84:D100,))","v":{"v":5,"d":"5.0"}},null,2,{"$f":"'Obliczenia nośności W'!$E$13","v":{"v":4.166666666666667,"d":"4.17"}},{"$f":"IF($J$85<$O$9,0,'Obliczenia nośności W'!$E$29)","v":{"v":0,"d":"0.00"}},{"$f":"SMALL(K84:K100,2)","v":{"v":0,"d":"0.00"}},{"$f":"INDEX(I84:I100,MATCH(L85,K84:K100,))","v":1},{"$f":"INDEX(J84:J100,MATCH(L85,K84:K100,))","v":{"v":3.3333333333333335,"d":"3.3"}},null,2,{"$f":"'Obliczenia nośności H'!$E$27","v":{"v":5.208333333333334,"d":"5.21"}},{"$f":"IF($Q$85<$O$9,0,'Obliczenia nośności H'!$E$43)","v":{"v":1.484375,"d":"1.48"}},{"$f":"SMALL(R84:R103,2)","v":{"v":0,"d":"0.00"}},{"$f":"INDEX(P84:P103,MATCH(S85,R84:R103,))","v":1},{"$f":"INDEX(Q84:Q103,MATCH(S85,R84:R103,))","v":{"v":4.166666666666667,"d":"4.2"}}]
[null,3,{"$f":"'Obliczenia nośności T'!$F$13","v":{"v":6,"d":"6.00"}},{"$f":"IF($C$86<$O$9,0,'Obliczenia nośności T'!$F$29)","v":{"v":1.6800000000000002,"d":"1.68"}},{"$f":"SMALL(D84:D100,3)","v":{"v":1.6800000000000002,"d":"1.68"}},{"$f":"INDEX(B84:B100,MATCH(E86,D84:D100,))","v":3},{"$f":"INDEX(C84:C100,MATCH(E86,D84:D100,))","v":{"v":6,"d":"6.0"}},null,3,{"$f":"'Obliczenia nośności W'!$F$13","v":{"v":5,"d":"5.00"}},{"$f":"IF($J$86<$O$9,0,'Obliczenia nośności W'!$F$29)","v":{"v":0.925,"d":"0.93"}},{"$f":"SMALL(K84:K100,3)","v":{"v":0,"d":"0.00"}},{"$f":"INDEX(I84:I100,MATCH(L86,K84:K100,))","v":1},{"$f":"INDEX(J84:J100,MATCH(L86,K84:K100,))","v":{"v":3.3333333333333335,"d":"3.3"}},null,3,{"$f":"'Obliczenia nośności H'!$F$27","v":6.25},{"$f":"IF($Q$86<$O$9,0,'Obliczenia nośności H'!$F$43)","v":{"v":1.78125,"d":"1.78"}},{"$f":"SMALL(R84:R103,3)","v":{"v":1.484375,"d":"1.48"}},{"$f":"INDEX(P84:P103,MATCH(S86,R84:R103,))","v":2},{"$f":"INDEX(Q84:Q103,MATCH(S86,R84:R103,))","v":{"v":5.208333333333334,"d":"5.2"}}]
[null,4,{"$f":"'Obliczenia nośności T'!$G$13","v":{"v":7,"d":"7.00"}},{"$f":"IF($C$87<$O$9,0,'Obliczenia nośności T'!$G$29)","v":{"v":2,"d":"2.00"}},{"$f":"SMALL(D84:D100,4)","v":{"v":2,"d":"2.00"}},{"$f":"INDEX(B84:B100,MATCH(E87,D84:D100,))","v":4},{"$f":"INDEX(C84:C100,MATCH(E87,D84:D100,))","v":{"v":7,"d":"7.0"}},null,4,{"$f":"'Obliczenia nośności W'!$G$13","v":{"v":5.833333333333334,"d":"5.83"}},{"$f":"IF($J$87<$O$9,0,'Obliczenia nośności W'!$G$29)","v":{"v":1.0791666666666668,"d":"1.08"}},{"$f":"SMALL(K84:K100,4)","v":{"v":0.925,"d":"0.93"}},{"$f":"INDEX(I84:I100,MATCH(L87,K84:K100,))","v":3},{"$f":"INDEX(J84:J100,MATCH(L87,K84:K100,))","v":{"v":5,"d":"5.0"}},null,4,{"$f":"'Obliczenia nośności H'!$G$27","v":{"v":7.291666666666667,"d":"7.29"}},{"$f":"IF($Q$87<$O$9,0,'Obliczenia nośności H'!$G$43)","v":{"v":2.078125,"d":"2.08"}},{"$f":"SMALL(R84:R103,4)","v":{"v":1.7812499999999998,"d":"1.78"}},{"$f":"INDEX(P84:P103,MATCH(S87,R84:R103,))","v":14},{"$f":"INDEX(Q84:Q103,MATCH(S87,R84:R103,))","v":{"v":6.25,"d":"6.3"}}]
[null,5,{"$f":"'Obliczenia nośności T'!$H$13","v":{"v":8,"d":"8.00"}},{"$f":"IF($C$88<$O$9,0,'Obliczenia nośności T'!$H$29)","v":{"v":2.3200000000000003,"d":"2.32"}},{"$f":"SMALL(D84:D100,5)","v":{"v":2.3200000000000003,"d":"2.32"}},{"$f":"INDEX(B84:B100,MATCH(E88,D84:D100,))","v":5},{"$f":"INDEX(C84:C100,MATCH(E88,D84:D100,))","v":{"v":8,"d":"8.0"}},null,5,{"$f":"'Obliczenia nośności W'!$H$13","v":{"v":6.666666666666667,"d":"6.67"}},{"$f":"IF($J$88<$O$9,0,'Obliczenia nośności W'!$H$29)","v":{"v":1.2333333333333334,"d":"1.23"}},{"$f":"SMALL(K84:K100,5)","v":{"v":1.0791666666666668,"d":"1.08"}},{"$f":"INDEX(I84:I100,MATCH(L88,K84:K100,))","v":4},{"$f":"INDEX(J84:J100,MATCH(L88,K84:K100,))","v":{"v":5.833333333333334,"d":"5.8"}},null,5,{"$f":"'Obliczenia nośności H'!$H$27","v":{"v":8.333333333333334,"d":"8.33"}},{"$f":"IF($Q$88<$O$9,0,'Obliczenia nośności H'!$H$43)","v":{"v":2.375,"d":"2.38"}},{"$f":"SMALL(R84:R103,5)","v":{"v":1.78125,"d":"1.78"}},{"$f":"INDEX(P84:P103,MATCH(S88,R84:R103,))","v":3},{"$f":"INDEX(Q84:Q103,MATCH(S88,R84:R103,))","v":{"v":6.25,"d":"6.3"}}]
[null,6,{"$f":"'Obliczenia nośności T'!$I$13","v":{"v":9,"d":"9.00"}},{"$f":"IF($C$89<$O$9,0,'Obliczenia nośności T'!$I$29)","v":2.64},{"$f":"SMALL(D84:D100,6)","v":2.64},{"$f":"INDEX(B84:B100,MATCH(E89,D84:D100,))","v":6},{"$f":"INDEX(C84:C100,MATCH(E89,D84:D100,))","v":{"v":9,"d":"9.0"}},null,6,{"$f":"'Obliczenia nośności W'!$I$13","v":{"v":7.5,"d":"7.50"}},{"$f":"IF($J$89<$O$9,0,'Obliczenia nośności W'!$I$29)","v":{"v":1.3875,"d":"1.39"}},{"$f":"SMALL(K84:K100,6)","v":{"v":1.2333333333333334,"d":"1.23"}},{"$f":"INDEX(I84:I100,MATCH(L89,K84:K100,))","v":5},{"$f":"INDEX(J84:J100,MATCH(L89,K84:K100,))","v":{"v":6.666666666666667,"d":"6.7"}},null,6,{"$f":"'Obliczenia nośności H'!$I$27","v":{"v":9.375,"d":"9.38"}},{"$f":"IF($Q$89<$O$9,0,'Obliczenia nośności H'!$I$43)","v":{"v":2.671875,"d":"2.67"}},{"$f":"SMALL(R84:R103,6)","v":{"v":2.078125,"d":"2.08"}},{"$f":"INDEX(P84:P103,MATCH(S89,R84:R103,))","v":4},{"$f":"INDEX(Q84:Q103,MATCH(S89,R84:R103,))","v":{"v":7.291666666666667,"d":"7.3"}}]
[null,7,{"$f":"'Obliczenia nośności T'!$J$13","v":{"v":10,"d":"10.00"}},{"$f":"IF($C$90<$O$9,0,'Obliczenia nośności T'!$J$29)","v":2.96},{"$f":"SMALL(D84:D100,7)","v":2.84},{"$f":"INDEX(B84:B100,MATCH(E90,D84:D100,))","v":17},{"$f":"INDEX(C84:C100,MATCH(E90,D84:D100,))","v":{"v":10,"d":"10.0"}},null,7,{"$f":"'Obliczenia nośności W'!$J$13","v":{"v":8.333333333333334,"d":"8.33"}},{"$f":"IF($J$90<$O$9,0,'Obliczenia nośności W'!$J$29)","v":{"v":1.5416666666666667,"d":"1.54"}},{"$f":"SMALL(K84:K100,7)","v":{"v":1.3875,"d":"1.39"}},{"$f":"INDEX(I84:I100,MATCH(L90,K84:K100,))","v":6},{"$f":"INDEX(J84:J100,MATCH(L90,K84:K100,))","v":7.5},null,7,{"$f":"'Obliczenia nośności H'!$J$27","v":{"v":10.416666666666668,"d":"10.42"}},{"$f":"IF($Q$90<$O$9,0,'Obliczenia nośności H'!$J$43)","v":{"v":2.96875,"d":"2.97"}},{"$f":"SMALL(R84:R103,7)","v":{"v":2.375,"d":"2.38"}},{"$f":"INDEX(P84:P103,MATCH(S90,R84:R103,))","v":5},{"$f":"INDEX(Q84:Q103,MATCH(S90,R84:R103,))","v":{"v":8.333333333333334,"d":"8.3"}}]
[null,8,{"$f":"'Obliczenia nośności T'!$K$13","v":{"v":11,"d":"11.00"}},{"$f":"IF($C$91<$O$9,0,'Obliczenia nośności T'!$K$29)","v":{"v":3.2800000000000002,"d":"3.28"}},{"$f":"SMALL(D84:D100,8)","v":2.96},{"$f":"INDEX(B84:B100,MATCH(E91,D84:D100,))","v":7},{"$f":"INDEX(C84:C100,MATCH(E91,D84:D100,))","v":{"v":10,"d":"10.0"}},null,8,{"$f":"'Obliczenia nośności W'!$K$13","v":{"v":9.166666666666668,"d":"9.17"}},{"$f":"IF($J$91<$O$9,0,'Obliczenia nośności W'!$K$29)","v":{"v":1.6958333333333335,"d":"1.70"}},{"$f":"SMALL(K84:K100,8)","v":{"v":1.5416666666666667,"d":"1.54"}},{"$f":"INDEX(I84:I100,MATCH(L91,K84:K100,))","v":7},{"$f":"INDEX(J84:J100,MATCH(L91,K84:K100,))","v":{"v":8.333333333333334,"d":"8.3"}},null,8,{"$f":"'Obliczenia nośności H'!$K$27","v":{"v":11.458333333333334,"d":"11.46"}},{"$f":"IF($Q$91<$O$9,0,'Obliczenia nośności H'!$K$43)","v":{"v":3.265625,"d":"3.27"}},{"$f":"SMALL(R84:R103,8)","v":{"v":2.375,"d":"2.38"}},{"$f":"INDEX(P84:P103,MATCH(S91,R84:R103,))","v":5},{"$f":"INDEX(Q84:Q103,MATCH(S91,R84:R103,))","v":{"v":8.333333333333334,"d":"8.3"}}]
[null,9,{"$f":"'Obliczenia nośności T'!$L$13","v":{"v":12,"d":"12.00"}},{"$f":"IF($C$92<$O$9,0,'Obliczenia nośności T'!$L$29)","v":{"v":3.6,"d":"3.60"}},{"$f":"SMALL(D84:D100,9)","v":{"v":3.2800000000000002,"d":"3.28"}},{"$f":"INDEX(B84:B100,MATCH(E92,D84:D100,))","v":8},{"$f":"INDEX(C84:C100,MATCH(E92,D84:D100,))","v":{"v":11,"d":"11.0"}},null,9,{"$f":"'Obliczenia nośności W'!$L$13","v":{"v":10,"d":"10.00"}},{"$f":"IF($J$92<$O$9,0,'Obliczenia nośności W'!$L$29)","v":1.85},{"$f":"SMALL(K84:K100,9)","v":{"v":1.6958333333333335,"d":"1.70"}},{"$f":"INDEX(I84:I100,MATCH(L92,K84:K100,))","v":8},{"$f":"INDEX(J84:J100,MATCH(L92,K84:K100,))","v":{"v":9.166666666666668,"d":"9.2"}},null,9,{"$f":"'Obliczenia nośności H'!$L$27","v":{"v":12.5,"d":"12.50"}},{"$f":"IF($Q$92<$O$9,0,'Obliczenia nośności H'!$L$43)","v":{"v":3.5625,"d":"3.56"}},{"$f":"SMALL(R84:R103,9)","v":{"v":2.671875,"d":"2.67"}},{"$f":"INDEX(P84:P103,MATCH(S92,R84:R103,))","v":6},{"$f":"INDEX(Q84:Q103,MATCH(S92,R84:R103,))","v":{"v":9.375,"d":"9.4"}}]
[null,10,{"$f":"'Obliczenia nośności T'!$M$13","v":{"v":12,"d":"12.00"}},{"$f":"IF($C$93<$O$9,0,'Obliczenia nośności T'!$M$29)","v":3.48},{"$f":"SMALL(D84:D100,10)","v":3.48},{"$f":"INDEX(B84:B100,MATCH(E93,D84:D100,))","v":10},{"$f":"INDEX(C84:C100,MATCH(E93,D84:D100,))","v":{"v":12,"d":"12.0"}},null,10,{"$f":"'Obliczenia nośności W'!$M$13","v":{"v":10.833333333333334,"d":"10.83"}},{"$f":"IF($J$93<$O$9,0,'Obliczenia nośności W'!$M$29)","v":{"v":2.0208333333333335,"d":"2.02"}},{"$f":"SMALL(K84:K100,10)","v":1.85},{"$f":"INDEX(I84:I100,MATCH(L93,K84:K100,))","v":9},{"$f":"INDEX(J84:J100,MATCH(L93,K84:K100,))","v":{"v":10,"d":"10.0"}},null,10,{"$f":"'Obliczenia nośności H'!$M$27","v":{"v":13.541666666666668,"d":"13.54"}},{"$f":"IF($Q$93<$O$9,0,'Obliczenia nośności H'!$M$43)","v":{"v":3.8593749999999996,"d":"3.86"}},{"$f":"SMALL(R84:R103,10)","v":{"v":2.96875,"d":"2.97"}},{"$f":"INDEX(P84:P103,MATCH(S93,R84:R103,))","v":7},{"$f":"INDEX(Q84:Q103,MATCH(S93,R84:R103,))","v":{"v":10.416666666666668,"d":"10.4"}}]
[null,11,{"$f":"'Obliczenia nośności T'!$N$13","v":{"v":13,"d":"13.00"}},{"$f":"IF($C$94<$O$9,0,'Obliczenia nośności T'!$N$29)","v":3.92},{"$f":"SMALL(D84:D100,11)","v":{"v":3.6,"d":"3.60"}},{"$f":"INDEX(B84:B100,MATCH(E94,D84:D100,))","v":9},{"$f":"INDEX(C84:C100,MATCH(E94,D84:D100,))","v":{"v":12,"d":"12.0"}},null,11,{"$f":"'Obliczenia nośności W'!$N$13","v":{"v":11.666666666666668,"d":"11.67"}},{"$f":"IF($J$94<$O$9,0,'Obliczenia nośności W'!$N$29)","v":{"v":2.191666666666667,"d":"2.19"}},{"$f":"SMALL(K84:K100,11)","v":{"v":2.0208333333333335,"d":"2.02"}},{"$f":"INDEX(I84:I100,MATCH(L94,K84:K100,))","v":10},{"$f":"INDEX(J84:J100,MATCH(L94,K84:K100,))","v":{"v":10.833333333333334,"d":"10.8"}},null,11,{"$f":"'Obliczenia nośności H'!$N$27","v":{"v":14.583333333333334,"d":"14.58"}},{"$f":"IF($Q$94<$O$9,0,'Obliczenia nośności H'!$N$43)","v":{"v":4.15625,"d":"4.16"}},{"$f":"SMALL(R84:R103,11)","v":{"v":2.96875,"d":"2.97"}},{"$f":"INDEX(P84:P103,MATCH(S94,R84:R103,))","v":7},{"$f":"INDEX(Q84:Q103,MATCH(S94,R84:R103,))","v":{"v":10.416666666666668,"d":"10.4"}}]
[null,12,{"$f":"'Obliczenia nośności T'!$O$13","v":{"v":13,"d":"13.00"}},{"$f":"IF($C$95<$O$9,0,'Obliczenia nośności T'!$O$29)","v":{"v":3.8000000000000003,"d":"3.80"}},{"$f":"SMALL(D84:D100,12)","v":{"v":3.8000000000000003,"d":"3.80"}},{"$f":"INDEX(B84:B100,MATCH(E95,D84:D100,))","v":12},{"$f":"INDEX(C84:C100,MATCH(E95,D84:D100,))","v":{"v":13,"d":"13.0"}},null,12,{"$f":"'Obliczenia nośności W'!$O$13","v":{"v":12.5,"d":"12.50"}},{"$f":"IF($J$95<$O$9,0,'Obliczenia nośności W'!$O$29)","v":{"v":2.3625,"d":"2.36"}},{"$f":"SMALL(K84:K100,12)","v":{"v":2.191666666666667,"d":"2.19"}},{"$f":"INDEX(I84:I100,MATCH(L95,K84:K100,))","v":11},{"$f":"INDEX(J84:J100,MATCH(L95,K84:K100,))","v":{"v":11.666666666666668,"d":"11.7"}},null,12,{"$f":"'Obliczenia nośności H'!$O$27","v":{"v":15.625,"d":"15.63"}},{"$f":"IF($Q$95<$O$9,0,'Obliczenia nośności H'!$O$43)","v":{"v":4.453125,"d":"4.45"}},{"$f":"SMALL(R84:R103,12)","v":{"v":3.265625,"d":"3.27"}},{"$f":"INDEX(P84:P103,MATCH(S95,R84:R103,))","v":8},{"$f":"INDEX(Q84:Q103,MATCH(S95,R84:R103,))","v":{"v":11.458333333333334,"d":"11.5"}}]
[null,13,{"$f":"'Obliczenia nośności T'!$P$13","v":{"v":14,"d":"14.00"}},{"$f":"IF($C$96<$O$9,0,'Obliczenia nośności T'!$P$29)","v":4.24},{"$f":"SMALL(D84:D100,13)","v":3.92},{"$f":"INDEX(B84:B100,MATCH(E96,D84:D100,))","v":11},{"$f":"INDEX(C84:C100,MATCH(E96,D84:D100,))","v":{"v":13,"d":"13.0"}},null,13,{"$f":"'Obliczenia nośności W'!$P$13","v":{"v":13.333333333333334,"d":"13.33"}},{"$f":"IF($J$96<$O$9,0,'Obliczenia nośności W'!$P$29)","v":{"v":2.533333333333333,"d":"2.53"}},{"$f":"SMALL(K84:K100,13)","v":{"v":2.3625,"d":"2.36"}},{"$f":"INDEX(I84:I100,MATCH(L96,K84:K100,))","v":12},{"$f":"INDEX(J84:J100,MATCH(L96,K84:K100,))","v":12.5},null,13,{"$f":"'Obliczenia nośności H'!$P$27","v":{"v":4.166666666666667,"d":"4.17"}},{"$f":"IF($Q$96<$O$9,0,'Obliczenia nośności H'!$P$43)","v":{"v":0,"d":"0.00"}},{"$f":"SMALL(R84:R103,13)","v":{"v":3.5624999999999996,"d":"3.56"}},{"$f":"INDEX(P84:P103,MATCH(S96,R84:R103,))","v":17},{"$f":"INDEX(Q84:Q103,MATCH(S96,R84:R103,))","v":12.5}]
[null,14,{"$f":"'Obliczenia nośności T'!$Q$13","v":{"v":14,"d":"14.00"}},{"$f":"IF($C$97<$O$9,0,'Obliczenia nośności T'!$Q$29)","v":4.12},{"$f":"SMALL(D84:D100,14)","v":4.12},{"$f":"INDEX(B84:B100,MATCH(E97,D84:D100,))","v":14},{"$f":"INDEX(C84:C100,MATCH(E97,D84:D100,))","v":{"v":14,"d":"14.0"}},null,14,{"$f":"'Obliczenia nośności W'!$Q$13","v":{"v":3.3333333333333335,"d":"3.33"}},{"$f":"IF($J$97<$O$9,0,'Obliczenia nośności W'!$Q$29)","v":{"v":0,"d":"0.00"}},{"$f":"SMALL(K84:K100,14)","v":{"v":2.533333333333333,"d":"2.53"}},{"$f":"INDEX(I84:I100,MATCH(L97,K84:K100,))","v":13},{"$f":"INDEX(J84:J100,MATCH(L97,K84:K100,))","v":{"v":13.333333333333334,"d":"13.3"}},null,14,{"$f":"'Obliczenia nośności H'!$Q$27","v":6.25},{"$f":"IF($Q$97<$O$9,0,'Obliczenia nośności H'!$Q$43)","v":{"v":1.7812499999999998,"d":"1.78"}},{"$f":"SMALL(R84:R103,14)","v":{"v":3.5625,"d":"3.56"}},{"$f":"INDEX(P84:P103,MATCH(S97,R84:R103,))","v":9},{"$f":"INDEX(Q84:Q103,MATCH(S97,R84:R103,))","v":12.5}]
[null,15,{"$f":"'Obliczenia nośności T'!$R$13","v":{"v":15,"d":"15.00"}},{"$f":"IF($C$98<$O$9,0,'Obliczenia nośności T'!$R$29)","v":{"v":4.4399999999999995,"d":"4.44"}},{"$f":"SMALL(D84:D100,15)","v":4.24},{"$f":"INDEX(B84:B100,MATCH(E98,D84:D100,))","v":13},{"$f":"INDEX(C84:C100,MATCH(E98,D84:D100,))","v":{"v":14,"d":"14.0"}},{"$nulls":8},15,{"$f":"'Obliczenia nośności H'!$R$27","v":{"v":8.333333333333334,"d":"8.33"}},{"$f":"IF($Q$98<$O$9,0,'Obliczenia nośności H'!$R$43)","v":{"v":2.375,"d":"2.38"}},{"$f":"SMALL(R84:R103,15)","v":{"v":3.8593749999999996,"d":"3.86"}},{"$f":"INDEX(P84:P103,MATCH(S98,R84:R103,))","v":10},{"$f":"INDEX(Q84:Q103,MATCH(S98,R84:R103,))","v":{"v":13.541666666666668,"d":"13.5"}}]
[null,16,{"$f":"'Obliczenia nośności T'!$S$13","v":{"v":16,"d":"16.00"}},{"$f":"IF($C$99<$O$9,0,'Obliczenia nośności T'!$S$29)","v":4.76},{"$f":"SMALL(D84:D100,16)","v":{"v":4.4399999999999995,"d":"4.44"}},{"$f":"INDEX(B84:B100,MATCH(E99,D84:D100,))","v":15},{"$f":"INDEX(C84:C100,MATCH(E99,D84:D100,))","v":{"v":15,"d":"15.0"}},{"$nulls":8},16,{"$f":"'Obliczenia nośności H'!$S$27","v":{"v":10.416666666666668,"d":"10.42"}},{"$f":"IF($Q$99<$O$9,0,'Obliczenia nośności H'!$S$43)","v":{"v":2.96875,"d":"2.97"}},{"$f":"SMALL(R84:R103,16)","v":{"v":4.15625,"d":"4.16"}},{"$f":"INDEX(P84:P103,MATCH(S99,R84:R103,))","v":11},{"$f":"INDEX(Q84:Q103,MATCH(S99,R84:R103,))","v":{"v":14.583333333333334,"d":"14.6"}}]
[null,17,{"$f":"'Obliczenia nośności T'!$T$13","v":{"v":10,"d":"10.00"}},{"$f":"IF($C$100<$O$9,0,'Obliczenia nośności T'!$T$29)","v":2.84},{"$f":"SMALL(D84:D100,17)","v":4.76},{"$f":"INDEX(B84:B100,MATCH(E100,D84:D100,))","v":16},{"$f":"INDEX(C84:C100,MATCH(E100,D84:D100,))","v":{"v":16,"d":"16.0"}},{"$nulls":8},17,{"$f":"'Obliczenia nośności H'!$T$27","v":{"v":12.5,"d":"12.50"}},{"$f":"IF($Q$100<$O$9,0,'Obliczenia nośności H'!$T$43)","v":{"v":3.5624999999999996,"d":"3.56"}},{"$f":"SMALL(R84:R103,17)","v":{"v":4.15625,"d":"4.16"}},{"$f":"INDEX(P84:P103,MATCH(S100,R84:R103,))","v":11},{"$f":"INDEX(Q84:Q103,MATCH(S100,R84:R103,))","v":{"v":14.583333333333334,"d":"14.6"}}]
[{"$nulls":15},18,{"$f":"'Obliczenia nośności H'!$U$27","v":{"v":14.583333333333334,"d":"14.58"}},{"$f":"IF($Q$101<$O$9,0,'Obliczenia nośności H'!$U$43)","v":{"v":4.15625,"d":"4.16"}},{"$f":"SMALL(R84:R103,18)","v":{"v":4.453125,"d":"4.45"}},{"$f":"INDEX(P84:P103,MATCH(S101,R84:R103,))","v":12},{"$f":"INDEX(Q84:Q103,MATCH(S101,R84:R103,))","v":{"v":15.625,"d":"15.6"}}]
[{"$nulls":15},19,{"$f":"'Obliczenia nośności H'!$V$27","v":{"v":16.666666666666668,"d":"16.67"}},{"$f":"IF($Q$102<$O$9,0,'Obliczenia nośności H'!$V$43)","v":4.75},{"$f":"SMALL(R84:R103,19)","v":4.75},{"$f":"INDEX(P84:P103,MATCH(S102,R84:R103,))","v":19},{"$f":"INDEX(Q84:Q103,MATCH(S102,R84:R103,))","v":{"v":16.666666666666668,"d":"16.7"}}]
[{"$nulls":15},20,{"$f":"'Obliczenia nośności H'!$W$27","v":{"v":20.833333333333336,"d":"20.83"}},{"$f":"IF($Q$103<$O$9,0,'Obliczenia nośności H'!$W$43)","v":{"v":5.9375,"d":"5.94"}},{"$f":"SMALL(R84:R103,20)","v":{"v":5.9375,"d":"5.94"}},{"$f":"INDEX(P84:P103,MATCH(S103,R84:R103,))","v":20},{"$f":"INDEX(Q84:Q103,MATCH(S103,R84:R103,))","v":{"v":20.833333333333336,"d":"20.8"}}]

{"sheet":"Rozmieszczenie łączników","index":15,"n_rows":2,"n_cols":2,"rows_kept":2,"merged":[[1,1,2,21],[4,5,30,17]]}
[]
[null,"Możliwe położenia łączników wg prEN 17237:2018"]

{"sheet":"Strefy i teren","index":16,"n_rows":81,"n_cols":11,"rows_kept":81,"merged":[[1,1,2,21],[4,7,25,15],[26,5,27,17],[28,5,29,17],[31,1,32,21],[34,5,43,9],[34,10,34,17],[36,10,42,17],[45,5,54,9],[45,10,45,17],[47,10,53,17],[56,5,65,9],[56,10,56,17],[58,10,64,17],[67,5,76,9],[67,10,67,17],[69,10,75,17],[78,5,87,9],[78,10,78,17],[80,10,85,17]]}
[]
[null,"Podział Polski na strefy obciążenia wiatrem wg PN-EN 1991-1-4:2008"]
{"$rows_empty":24}
[{"$nulls":5},"Mapa podziału Polski na strefy wartości podstawowej bazowej predkości wiatru vb,0"]
[]
[{"$nulls":5},"Na granicy stref 1 i 2, w pasach o szerokości 10 km po obu stronach granicy, można stosować wartość średnią z obu stref."]
[]
[]
[null,"Kategorie terenu wg PN-EN 1991-1-4:2008"]
[]
[]
[{"$nulls":10},"Kategoria 0"]
[]
[{"$nulls":10},"Morze, obszar brzegowy otwarty na morze"]
{"$rows_empty":8}
[{"$nulls":10},"Kategoria I"]
[]
[{"$nulls":10},"Jeziora albo obszary z pomijalną niewielką roślinnością i bez przeszkód"]
{"$rows_empty":8}
[{"$nulls":10},"Kategoria II"]
[]
[{"$nulls":10},"Obszary z niską roślinnością, taką jak trawa, oraz pojedynczymi przeszkodami (drzewa, budynki) oddalonymi od siebie na odległość nie mniejszą niż 20 ich wysokości"]
{"$rows_empty":8}
[{"$nulls":10},"Kategoria III"]
[]
[{"$nulls":10},"Obszary regularnie pokryte roślinnością albo budynkami lub z pojedynczymi przeszkodami oddalonymi od siebie na odległość nie większą niż 20 ich wysokości (jak wsie, tereny podmiejskie, stałe lasy)"]
{"$rows_empty":8}
[{"$nulls":10},"Kategoria IV"]
[]
[{"$nulls":10},"Obszary, na których przynajmniej 15 % powierzchni pokrywają budynki o średniej wysokości przekraczającej 15 m"]

{"sheet":"Wsp kierunkowy","index":17,"n_rows":18,"n_cols":2,"rows_kept":18,"merged":[[1,1,2,21],[4,5,15,17],[17,1,18,21],[20,7,47,15]]}
[]
[null,"Współczynnik kierunkowy wg PN-EN 1991-1-4:2008"]
{"$rows_empty":15}
[null,"Określenie kąta odchylenia wybranej osi budynku od kierunku północnego i przypadki (kierunki) oddziaływania wiatru"]

{"sheet":"Pola ścian","index":18,"n_rows":2,"n_cols":2,"rows_kept":2,"merged":[[1,1,2,21],[4,5,46,17]]}
[]
[null,"Oznaczenia pól na ścianach pionowych budynków na rzucie prostokąta, wg PN-EN 1991-1-4:2008"]

{"sheet":"Wysokość przemieszczenia","index":19,"n_rows":54,"n_cols":14,"rows_kept":54,"merged":[[1,1,2,21],[4,2,7,20],[8,4,18,8],[8,9,18,18],[19,2,19,20],[20,3,20,5],[20,6,20,20],[21,3,21,5],[21,6,21,20],[22,3,22,5],[22,6,22,20],[24,2,25,20],[27,2,28,20],[29,4,45,18],[47,5,48,17],[50,6,50,11],[50,13,50,14],[51,6,51,11],[51,13,51,14],[52,6,52,11],[52,13,52,14],[53,6,53,11],[53,13,53,14]]}
[]
[null,"Wysokość przemieszczenia hdis wg PN-EN 1991-1-4:2008"]
[]
[]
[null,null,"Wysokość przemieszczenia\nW terenie kategorii IV budynki i inne przeszkody usytuowane blisko siebie powodują, że wiatr zachowuje się tak, jak gdyby poziom terenu został podniesiony na wysokość hdis, nazywaną wysokością przemieszczenia."]
[]
[]
[]
[{"$nulls":9},"Kategoria terenu IV\nObszary, na których przynajmniej 15 % powierzchni pokrywają budynki o średniej wysokości przekraczającej 15 m\n"]
{"$rows_empty":10}
[null,null,"Wysokość hdis można wyznaczyć z poniższych zależności (patrz rysunek):"]
[{"$nulls":3},"x ≤ 2 ∙ have",null,null,"hdis jest wartością mniejszą z dwóch: 0,8 ∙ have  albo  0,6 ∙ h"]
[{"$nulls":3},"2 ∙ have < x < 6 ∙ have",null,null,"hdis jest wartością mniejszą z dwóch: (1,2 ∙ have - 0,2 ∙ x)  albo  0,6 ∙ h"]
[{"$nulls":3},"x ≥ 6 ∙ have",null,null,"hdis = 0"]
[]
[null,null,"Warunki te zależą od kierunku wiatru; wartości  have oraz x należy zatem ustalać w sektorach  o rozwartości 30°."]
[]
[]
[null,null,"Przy braku dokładniejszych informacji średnią wysokość przeszkód w terenie kategorii IV można przyjąć jako równą have = 15 m. "]
{"$rows_empty":19}
[{"$nulls":5},"Obliczenia wysokości przemieszczenia"]
[]
[]
[{"$nulls":6},"Wysokość budynku h, m",{"$nulls":6},25]
[{"$nulls":6},"Wysokość przeszkód have, m",{"$nulls":6},15]
[{"$nulls":6},"Odległość x, m",{"$nulls":6},50]
[{"$nulls":6},"Wysokość przemieszczenia poziomu zerowego hdis, m",{"$nulls":6},{"$f":"IF(N53<=2*N52,MIN(0.8*N52,0.6*N51),IF(AND(N53>2*N52,N53<6*N52),MIN((1.2*N52-0.2*N53),0.6*N51),IF(N53>=6*N52,0,\"?\")))","v":8}]

{"sheet":"Notatki","index":20,"n_rows":0,"n_cols":0,"rows_kept":0,"merged":[[1,1,4,21],[5,1,8,21],[9,1,12,21]]}